program: Gaussian 09
title: 000129219
version: EM64L-G09RevD.01
frameworkgroup: C1[X(C24H24N4O5)]
method: RPBEPBE
basis: SDD
operation: Freq
keyword: #p
keyword: freq=noraman
keyword: PBEPBE/SDD
title: #p freq=noraman PBEPBE/SDD
converged: YES YES NO NO
title: Mulliken charges:
elementType: O O O O O N N N N C C C C C C C C C C C C C C C C C C C C C C C C H H H H H H H H H H H H H H H H H H H H H H H H
charge: -0.301153 -0.278155 -0.393587 -0.282099 -0.237653 -0.448870 0.041352 -0.366898 -0.087886 0.243962 -0.266489 0.391651 -0.060096 0.305471 0.350236 -0.194438 0.023264 0.219246 -0.401883 -0.519223 -0.418051 -0.387900 -0.501260 0.245075 -0.335448 0.184280 -0.233317 -0.228793 0.154870 -0.616324 -0.618425 -0.517102 -0.497007 0.407367 0.291924 0.292718 0.300921 0.251838 0.217990 0.285280 0.369350 0.245889 0.184554 0.236764 0.237901 0.224982 0.189546 0.221033 0.231871 0.187634 0.220151 0.209925 0.263084 0.234976 0.236928 0.247458 0.242565
chargesum: 0.00000
title: Mulliken charges with hydrogens summed into heavy atoms:
elementType: O O O O O N N N N C C C C C C C C C C C C C C C C C C C C C C C C
charge: -0.301153 -0.278155 -0.393587 -0.282099 -0.237653 -0.041503 0.041352 0.002452 -0.087886 0.243962 -0.266489 0.391651 -0.060096 0.305471 0.350236 -0.194438 0.023264 0.219246 -0.109959 -0.226505 -0.117129 0.081928 -0.215979 0.245075 0.094994 0.184280 0.003447 0.009108 0.154870 0.019237 0.021231 0.190883 0.229943
polarizability: 5.60589658e+02 8.21071606e+01 4.54017213e+02 -1.11657193e+01 1.30290809e+01 1.52604719e+02
1716.lowfreq: -4.6750 -0.0009 -0.0006 0.0007 3.0887 3.4630 17.3494 20.6681 23.5116
frequency: 17.2800 20.6141 23.5008 29.5608 35.2882 46.1209 72.5421 75.2324 84.0884 91.6123 96.4288 100.2586 121.2145 128.6141 135.1264 148.9291 154.1181 157.4538 177.7162 183.0365 213.2988 218.0417 224.5631 235.4752 240.2678 259.3684 271.4234 283.5529 297.7236 313.9845 333.4139 349.9493 352.9492 363.7498 380.1786 398.1436 415.0532 418.3065 441.3343 448.1904 453.2885 467.5930 488.0280 494.0906 514.7539 544.0477 551.3543 588.9536 603.2064 625.9265 656.6089 662.2764 673.9124 699.4248 714.6652 723.5274 741.9539 744.7270 757.7000 765.1222 775.0907 799.7609 805.7332 817.4337 829.2384 858.4967 888.5475 890.5154 898.2992 903.6364 906.1044 914.8879 937.7192 943.3566 997.1167 1004.5026 1014.2628 1019.6861 1034.9275 1038.9719 1041.3195 1054.8630 1072.6157 1081.3721 1091.4115 1103.6770 1106.0212 1114.0232 1137.8830 1138.6897 1140.8642 1148.1630 1153.8180 1161.6077 1171.1215 1182.8284 1193.3559 1210.3918 1236.5156 1238.0354 1249.7463 1263.4360 1270.5641 1278.4471 1295.9967 1305.8211 1326.3424 1332.4621 1352.0770 1367.9653 1371.7453 1380.5200 1398.4298 1416.1560 1419.7331 1423.2184 1432.1573 1440.3105 1449.2318 1451.7375 1452.5394 1453.1785 1457.8684 1462.2002 1462.9220 1468.1503 1474.6739 1475.8120 1481.1214 1481.5841 1486.4471 1486.5494 1499.3958 1527.9525 1556.3526 1565.8228 1591.0885 1608.7518 1615.3882 1629.1779 1633.4929 2543.2433 2846.4640 2851.1849 2868.7159 2972.4417 3005.9165 3017.4711 3021.5985 3026.0496 3049.5130 3077.5129 3082.4335 3083.5531 3094.4875 3108.3935 3130.6724 3135.6475 3152.2741 3153.3917 3167.6885 3170.0683 3172.9647 3175.1825 3178.3372
redmass: 3.3481 4.6810 3.0186 5.3208 5.0759 5.6146 3.8738 5.3288 4.5220 1.5670 2.2077 2.8850 3.1761 3.8402 4.6589 3.8389 3.5444 1.2976 3.9395 3.5963 3.4171 1.2184 2.1232 2.5745 4.6803 3.6298 4.3405 5.8985 5.3142 5.2056 5.5847 3.4261 6.2193 4.0527 6.7549 7.0597 3.5600 2.9895 3.9453 5.1662 7.7471 6.3291 3.8719 5.6113 5.3780 5.8267 6.1647 6.5436 7.1293 7.8734 7.5611 6.6158 5.3534 6.4309 4.3352 3.1217 5.2049 5.1690 5.4085 5.0040 3.0607 1.9062 1.8346 4.9257 3.2630 2.5074 4.5291 1.1626 4.6566 2.8242 2.3032 1.6955 2.0646 5.3368 1.3871 5.5208 1.3654 2.9416 1.5604 5.6687 2.0836 2.6917 2.2205 2.1640 1.3960 2.4860 1.2527 1.2648 2.7125 1.5992 1.1060 1.4743 1.5533 2.1023 1.1829 1.8799 1.9749 3.9840 1.6887 2.3790 1.9337 2.2808 2.1903 1.9493 3.0401 1.1740 1.4857 3.5439 6.9747 6.8845 1.3641 3.4839 9.6136 2.3216 1.1423 1.3261 1.7699 1.1505 3.2873 1.0514 1.0981 1.2205 3.2216 1.0629 1.0563 1.0571 3.2765 1.0762 1.0599 1.0921 1.3228 2.2403 6.9248 9.3786 7.2789 2.0134 5.7979 6.1929 7.0322 3.0669 8.1998 1.0980 1.0571 1.0639 1.0638 1.0336 1.0296 1.0727 1.0632 1.0691 1.0882 1.1007 1.1002 1.0999 1.1053 1.1045 1.1035 1.0864 1.1048 1.0910 1.0945 1.0924 1.0851 1.0985 1.0927
irintensity: 0.2606 0.1252 0.2463 0.8779 2.4989 0.5276 0.3532 0.8248 1.0388 1.1248 0.5365 2.6061 3.7168 1.4155 0.0205 3.8872 9.0359 1.1213 3.5255 1.9880 2.2336 1.0341 0.9049 3.9648 3.9439 3.4327 5.6923 14.6451 0.2458 9.8065 4.5615 7.7291 18.6225 13.6859 3.6582 30.6483 4.4704 3.4517 8.7634 2.3929 0.2545 1.7433 4.5125 38.3324 13.2591 19.1344 33.7185 10.8030 17.8031 11.5703 8.5705 3.3171 0.0452 17.1228 24.0400 1.3626 11.0556 14.6133 8.2703 4.1060 10.7690 7.4223 46.4385 17.5626 7.8776 0.0489 23.2855 103.4110 7.4066 12.1627 2.9455 18.8746 0.0402 60.3326 4.6250 27.1603 0.2051 33.9396 13.8378 180.8295 0.8776 57.7583 32.9166 2.7525 10.4783 6.4621 7.1575 0.4727 186.1691 39.0263 87.8934 78.4080 34.2794 38.0894 2.3252 92.6959 6.3050 254.7628 9.0290 6.4465 73.9667 5.5942 68.2801 63.8196 14.6187 3.6098 9.8984 90.4677 194.6993 11.0127 6.1523 58.0632 41.8655 3.8217 8.6912 37.9765 10.9884 7.8868 90.7185 13.7528 7.3089 4.0891 85.6416 10.1290 14.3735 15.7367 87.6597 33.9597 16.5059 16.9331 2.6400 49.5930 146.6342 87.1647 425.6067 612.8259 134.9605 30.9598 10.4958 267.5031 304.4334 595.6224 68.3298 88.8162 212.5057 88.7080 43.8849 40.9622 7.8821 90.7876 7.8972 20.6784 62.4061 27.4089 20.0778 23.1218 23.5871 4.0420 11.7624 16.6345 3.0521 2.4947 257.4086 9.1858 2.0409
temp: 298.150 k
press: 1.00000 atm
elementType: 8 8 8 8 8 7 7 7 7 6 6 6 6 6 6 6 6 6 6 6 6 6 6 6 6 6 6 6 6 6 6 6 6 1 1 1 1 1 1 1 1 1 1 1 1 1 1 1 1 1 1 1 1 1 1 1 1
symmnumber: 1
zpe: 1160781.4 jmol-1
zpe.correction: 0.442118 hartree
zpe.thermalcorrener: 0.472857 hartree
zpe.thermalcorrenthalpy: 0.473801 hartree
zpe.thermalcorrgfe: 0.377506 hartree
zpe.sumelectzpe: -1521.748295 hartree
zpe.sumelectthermal: -1521.717557 hartree
zpe.sumelectthermalent: -1521.716613 hartree
zpe.sumelectthermalfe: -1521.812907 hartree
dipole: -0.9074 -0.3868 -0.0568
dipole: 0.9880
quadrupole: -185.7575 -162.1676 -196.5034
quadrupole: -1.7554 10.1804 -3.1378
quadrupole: -4.2813 19.3086 -15.0273 -1.7554 10.1804 -3.1378
hfenergy: -1522.1904138 hartree
pointgroup: C01 [X(C24H24N4O5)]
dipole: -0.3772795 0.0627541 -0.0694605 debye
polarizability: 598.1429174|-14.9957063|410.7086964|52.3085211|12.166695|158.3599762 unknown
InChI: InChI=1S/C24H24N4O5/c1-28(2)10-9-25-23(30)19-21-20(13-7-5-6-8-14(13)22(19)29)26-17-12-18(32-3)15(24(31)33-4)11-16(17)27-21/h5-8,11-12,25,27H,9-10H2,1-4H3
charge 0 multiplicity 1
57 atoms
O  4.151821 -0.527925 0.210178
O  -5.202162 3.220613 -0.045845
O  0.351527 -2.354153 -0.425855
O  -5.572491 -1.005618 -0.332185
O  -6.561708 0.91471 -1.193498
N  -0.652778 -0.075237 -0.203988
N  -0.403806 2.692541 0.22152
N  2.654531 -2.64961 -0.262921
N  2.245642 -6.340449 0.57945
C  0.607239 0.452145 -0.000673
C  0.686137 1.904523 0.217024
C  2.009943 2.496407 0.434945
C  1.745675 -0.395453 -0.00979
C  3.164575 1.656238 0.427995
C  -1.799188 0.698927 -0.208728
C  3.064914 0.182763 0.20486
C  -1.652054 2.116045 0.0103
C  1.549344 -1.855458 -0.24131
C  2.155985 3.893988 0.652037
C  -3.082396 0.139617 -0.413636
C  4.444507 2.228873 0.63778
C  2.577109 -4.099322 -0.489845
C  -2.815294 2.930879 0.018891
C  -4.226317 0.96238 -0.428278
C  2.233048 -4.878693 0.80715
C  -4.087461 2.382152 -0.198352
C  3.430717 4.448177 0.858542
C  4.580035 3.612624 0.851366
C  -5.562207 0.346576 -0.6925
C  3.605787 -6.914419 0.556431
C  1.351934 -7.077929 1.494807
C  -5.725384 3.860918 -1.275448
C  -6.841938 -1.723596 -0.597753
H  -0.590523 -1.154355 -0.352521
H  1.25566 4.514455 0.652941
H  -3.196517 -0.937521 -0.562549
H  5.309727 1.559662 0.626839
H  1.795328 -4.31453 -1.237383
H  3.549676 -4.429547 -0.894779
H  -2.710814 3.999596 0.223292
H  3.553149 -2.147218 -0.092225
H  1.216944 -4.576184 1.116482
H  2.936251 -4.569141 1.621844
H  3.538734 5.525198 1.025554
H  5.572354 4.047396 1.01282
H  3.553056 -7.982616 0.279342
H  4.130638 -6.836842 1.543434
H  4.228553 -6.404881 -0.199173
H  0.326018 -6.677647 1.41578
H  1.665436 -7.023134 2.568708
H  1.324744 -8.144431 1.205359
H  -4.923646 4.433018 -1.782029
H  -6.15383 3.0968 -1.94526
H  -6.513778 4.544619 -0.927371
H  -6.663114 -2.747236 -0.241019
H  -7.669379 -1.247148 -0.046225
H  -7.070554 -1.710044 -1.676834
