program: Gaussian 09
title: 000012010
version: EM64L-G09RevD.01
frameworkgroup: C1[X(C6H10O2S2)]
method: RPBEPBE
basis: SDD
operation: Freq
keyword: #p
keyword: freq=noraman
keyword: PBEPBE/SDD
title: #p freq=noraman PBEPBE/SDD
converged: YES YES NO NO
title: Mulliken charges:
elementType: S S O O C C C C C C H H H H H H H H H H
charge: 0.087129 0.065488 -0.152535 -0.147915 -0.239157 -0.227923 -0.667954 -0.667589 -0.159074 -0.224088 0.249918 0.225999 0.234855 0.245708 0.212686 0.234996 0.241112 0.216081 0.241596 0.230667
chargesum: 0.00000
title: Mulliken charges with hydrogens summed into heavy atoms:
elementType: S S O O C C C C C C
charge: 0.087129 0.065488 -0.152535 -0.147915 0.236760 0.252640 0.020840 0.020755 -0.159074 -0.224088
polarizability: 1.16248900e+02 1.25139803e+00 1.26775937e+02 -1.16015974e+00 -1.18142706e+01 9.50840153e+01
1716.lowfreq: -12.0890 -11.1915 0.0012 0.0020 0.0022 5.7688 25.4944 57.6895 72.2753
frequency: 25.2277 57.6712 72.2580 97.9090 109.6594 127.1764 148.5190 205.2234 210.5348 243.9457 257.4478 308.8546 338.5825 395.9584 500.0865 562.2955 616.8352 657.6926 789.5540 798.9672 808.6309 835.5371 969.5762 1003.4910 1011.6876 1104.2549 1114.1521 1123.3288 1129.1597 1171.0394 1177.1449 1243.1972 1247.1553 1251.4328 1349.4596 1353.0538 1401.3974 1401.8190 1460.4381 1462.8642 1466.2799 1466.8228 1483.3712 1483.5912 2999.0273 2999.9169 3004.5658 3007.0816 3068.8650 3074.9602 3096.0545 3097.1605 3112.3746 3114.7876
redmass: 4.3895 2.3270 3.0196 2.8599 2.7577 5.0852 3.3205 2.5535 5.4935 1.2214 1.9211 3.7854 3.4902 6.7576 5.7554 11.1367 11.5535 7.0739 3.4857 1.0987 1.1566 5.0594 6.1039 2.1039 2.4195 2.3327 2.0104 1.5801 1.4652 7.1892 7.2457 1.2092 2.3127 1.6924 1.3842 1.3826 1.2466 1.2520 1.0392 1.0397 1.0726 1.0776 1.0577 1.0573 1.0372 1.0362 1.0568 1.0576 1.1069 1.1068 1.0982 1.0987 1.1022 1.1027
irintensity: 1.3498 0.3437 0.6653 2.1668 3.4891 0.2174 1.1309 1.5213 7.4237 0.4488 3.7990 3.1048 2.6632 8.1394 2.0901 2.1354 15.9795 2.9130 2.8183 4.7792 8.7295 9.6812 70.3187 42.9261 66.7339 7.3810 20.2604 15.5304 1.8087 515.5401 314.9307 0.9892 36.3126 49.4224 0.0429 3.5428 20.5373 21.5801 12.2489 13.6686 6.2110 5.5435 11.7993 10.7223 19.9349 16.4998 16.9206 8.4596 5.9594 5.1525 21.1282 21.9132 29.6454 30.6368
temp: 298.150 k
press: 1.00000 atm
elementType: 16 16 8 8 6 6 6 6 6 6 1 1 1 1 1 1 1 1 1 1
symmnumber: 1
zpe: 398464.6 jmol-1
zpe.correction: 0.151767 hartree
zpe.thermalcorrener: 0.164389 hartree
zpe.thermalcorrenthalpy: 0.165333 hartree
zpe.thermalcorrgfe: 0.110810 hartree
zpe.sumelectzpe: -1180.380233 hartree
zpe.sumelectthermal: -1180.367612 hartree
zpe.sumelectthermalent: -1180.366667 hartree
zpe.sumelectthermalfe: -1180.421190 hartree
dipole: -1.5839 -4.3928 -1.7674
dipole: 4.9929
quadrupole: -62.3635 -77.1019 -78.0053
quadrupole: -4.5433 1.1112 3.1014
quadrupole: 10.1267 -4.6117 -5.5150 -4.5433 1.1112 3.1014
hfenergy: -1180.5320004 hartree
pointgroup: C01 [X(C6H10O2S2)]
dipole: 0.6442822 1.8325524 0.2922538 debye
dipolederiv: -0.342635 0.0230326 -0.103655 0.0883469 -0.5916194 -0.3292493 -0.0460679 -0.3166227 -0.3829468 -0.3390257 -0.0748507 -0.1268088 -0.0730571 -0.1993758 -0.0178022 0.0342355 -0.0188 -0.7726426 -1.089347 0.905236 0.1684631 0.6402869 -0.9698307 -0.1924035 0.1057026 -0.1815426 -0.2651982 -1.2284334 -0.5598349 0.3708338 -0.5548862 -0.4497849 0.1848871 0.4520579 0.2941803 -0.6509339 0.4221629 -0.1727858 -0.0573561 -0.3667855 0.7363799 0.0797008 -0.189563 0.153929 0.2874313 0.8599787 0.2408377 -0.1951201 0.216831 0.4145563 -0.0650576 0.0270333 0.032162 0.2150826 -0.0812015 0.0816451 -0.0355509 0.1038015 -0.0275995 0.0008961 -0.0204608 -0.0015666 0.0565985 -0.0603237 -0.0593121 0.0819829 -0.0522097 0.035512 0.0356672 0.0781351 0.0306555 -0.0103509 1.0409671 -0.8986065 0.0401582 -0.6428392 0.8818943 0.3872848 0.0842156 0.4039521 0.2465289 0.7203449 0.5973472 -0.1948908 0.6212201 0.2660019 -0.05999 -0.5354617 -0.3054109 1.1875593 0.0913197 0.0061527 -0.0420354 0.0617617 -0.0330939 0.0419298 0.0216935 -0.0280233 -0.0810522 -0.1009419 -0.0892892 0.0302994 -0.0086308 -0.0587548 -0.0271772 0.0859044 -0.0191035 0.0452288 -0.0385005 0.0169554 0.0892759 -0.0000256 -0.0079756 -0.0549059 -0.0166915 -0.1006667 -0.0138243 -0.031856 -0.0393466 0.0232627 0.0170433 -0.07124 0.0831371 -0.0716992 0.0434882 0.0329123 0.0640831 0.0454911 -0.0006866 0.0676266 -0.0844464 -0.1025238 0.0126408 -0.1145882 0.0415978 0.0722036 0.0091984 0.0274699 -0.0089804 0.1066301 0.0350338 -0.0325513 0.0790596 -0.1094345 -0.0364861 -0.0697301 0.0240777 -0.1331507 0.0261851 0.0374444 0.0136394 0.0507238 0.0900318 -0.1123831 -0.0751577 -0.0504594 -0.0721427 0.0932405 -0.0061368 -0.0758204 -0.0125683 0.0511388 0.1178078 0.0063354 0.0015036 0.029742 -0.0182704 -0.1131735 0.0637907 -0.0732999 -0.0088324 0.072266 0.106682 -0.0507643 0.0660479 -0.0484089 0.0824386 0.0092671 0.0840422 0.0411058 unknown
polarizability: 116.2945796|0.5871311|107.8292628|1.8094195|19.49992|113.98501 unknown
InChI: InChI=1S/C6H10O2S2/c1-3-7-5(9)6(10)8-4-2/h3-4H2,1-2H3
charge 0 multiplicity 1
20 atoms
S  -0.572433 -2.218696 -1.296613
S  0.523845 -0.443753 2.07683
O  -1.914404 -0.121555 -0.349702
O  1.434305 0.199049 -0.429839
C  -2.04638 1.16147 0.433502
C  2.748944 0.586023 0.180562
C  -3.368596 1.78268 0.001099
C  3.6232 1.090424 -0.961037
C  -0.723138 -0.79768 -0.405565
C  0.455694 -0.302979 0.386966
H  -2.027237 0.897742 1.505386
H  -1.180698 1.80964 0.201958
H  2.554152 1.352639 0.953142
H  3.159416 -0.31147 0.677957
H  -3.539012 2.720208 0.561398
H  -3.364602 2.014674 -1.077089
H  -4.207458 1.097239 0.208024
H  4.613473 1.379351 -0.564861
H  3.768301 0.306213 -1.722633
H  3.17343 1.972178 -1.448086
