program: Gaussian 09
title: 000129066
version: EM64L-G09RevD.01
frameworkgroup: C1[X(C22H28Cl2N2)]
method: RPBEPBE
basis: SDD
operation: Freq
keyword: #p
keyword: freq=noraman
keyword: PBEPBE/SDD
title: #p freq=noraman PBEPBE/SDD
converged: YES YES NO NO
title: Mulliken charges:
elementType: Cl Cl N N C C C C C C C C C C C C C C C C C C C C C C H H H H H H H H H H H H H H H H H H H H H H H H H H H H
charge: -0.065975 -0.065974 -0.069958 -0.069965 -0.373716 -0.371737 -0.373737 -0.371728 -0.328474 -0.328478 -0.404738 -0.404728 -0.563514 -0.563512 0.520158 0.520123 -0.412061 -0.411924 -0.392457 -0.392551 -0.212848 -0.212875 -0.218138 -0.218102 -0.105720 -0.105719 0.203752 0.185149 0.182863 0.207672 0.203753 0.185150 0.182862 0.207647 0.204797 0.173020 0.204803 0.173007 0.221066 0.224154 0.221042 0.224180 0.205722 0.208159 0.205712 0.208157 0.238558 0.238557 0.238737 0.238735 0.252887 0.252885 0.252661 0.252661
chargesum: 0.00000
title: Mulliken charges with hydrogens summed into heavy atoms:
elementType: Cl Cl N N C C C C C C C C C C C C C C C C C C C C C C
charge: -0.065975 -0.065974 -0.069958 -0.069965 0.015185 0.018798 0.015165 0.018781 0.049343 0.049332 0.040482 0.040493 -0.149633 -0.149643 0.520158 0.520123 -0.173502 -0.173367 -0.153719 -0.153816 0.040039 0.040009 0.034523 0.034560 -0.105720 -0.105719
polarizability: 3.13091589e+02 -3.37619198e-02 2.76940032e+02 3.09740740e+01 -8.75387118e-03 2.19368566e+02
1716.lowfreq: -17.4656 -5.4873 -5.2377 -0.0003 0.0014 0.0017 3.4000 13.1821 14.2972
frequency: 2.4030 12.7872 14.2675 14.6384 17.9683 29.8422 42.4403 58.8172 77.8482 89.5893 103.2127 103.6695 126.0458 146.7415 186.6633 191.7861 229.2165 235.7155 238.5110 245.7499 253.9282 306.1396 332.7559 338.4396 347.9475 355.4806 356.0558 388.2129 397.9905 408.6267 408.6391 425.7973 439.8755 484.8494 488.8055 531.4350 531.6643 603.1547 626.8981 626.9048 638.5528 646.5180 718.2577 718.4716 756.8597 758.7408 759.6976 775.4966 804.3963 811.8351 828.9152 828.9579 834.5474 836.5370 846.8572 854.3962 859.2770 934.7404 948.2877 949.7351 965.2783 965.2954 999.6798 999.7866 1000.3030 1017.1936 1026.9825 1030.1188 1050.1614 1050.4763 1054.7582 1058.5160 1071.7384 1071.7667 1077.3494 1092.2212 1110.7739 1117.2537 1130.7846 1131.6321 1139.7892 1152.5701 1178.2540 1182.2103 1182.2697 1192.3832 1206.7765 1215.8048 1215.8167 1245.3895 1262.9327 1265.9467 1266.1439 1278.3161 1279.9169 1294.1540 1296.3114 1298.2535 1299.6762 1307.1916 1332.1803 1333.3726 1337.7106 1344.1075 1369.0253 1370.4797 1376.3697 1376.4080 1391.9280 1394.8942 1394.9050 1395.6815 1451.9057 1453.1756 1461.6146 1463.4019 1467.7390 1468.5898 1473.5922 1476.0623 1477.9311 1478.2955 1489.2920 1489.8604 1587.1285 1587.1305 1600.3482 1600.3722 2818.4283 2818.8032 2844.4224 2856.6399 2858.4307 2871.7008 2975.8813 2975.9030 2988.6353 2988.6705 2996.9241 2997.2650 3023.8124 3025.3431 3025.4235 3028.4708 3044.4759 3049.8141 3060.6555 3061.0477 3126.6181 3126.6213 3129.1112 3129.1202 3166.6590 3166.6682 3169.8680 3169.8816
redmass: 7.3388 3.9429 3.7248 4.1370 8.5087 3.6821 5.1156 4.5678 4.6291 2.6567 2.0252 3.4870 6.7477 2.9076 5.0102 4.3545 3.1120 4.5636 2.6548 2.0409 4.9990 4.2137 2.1278 4.4237 5.9048 2.6952 2.8274 8.3609 2.3768 2.8880 2.8840 3.2963 3.4625 2.8631 4.9407 2.9250 2.9389 2.5022 6.8988 6.8979 5.4300 3.3631 3.5691 3.5477 2.9232 1.2782 1.1248 3.2864 2.8547 2.3627 1.2537 1.2529 1.8935 1.9891 1.5710 1.3378 1.3315 2.1293 1.3596 1.3959 1.3700 1.3700 3.9442 4.3284 2.6370 3.1326 3.9820 3.1119 1.6923 1.6248 1.8644 2.9699 2.7011 2.7116 2.2451 1.9663 1.4473 1.3813 3.0233 1.6539 2.4943 2.4063 1.4223 1.1214 1.1219 1.2056 1.5863 2.5150 2.5486 1.2237 1.3377 1.3453 1.2768 1.2837 1.2190 1.1911 1.2703 1.2537 1.3338 1.3304 1.3624 1.4438 1.2856 1.4113 1.3553 1.4899 6.9009 6.7014 1.3921 2.6442 2.6438 1.5048 1.0802 1.0807 1.0870 1.0815 1.0980 1.1162 1.1972 1.3429 2.0264 1.7052 1.1023 1.1032 7.3202 7.3200 6.3555 6.3536 1.0707 1.0705 1.0710 1.0701 1.0704 1.0679 1.0593 1.0593 1.0704 1.0703 1.0753 1.0751 1.0913 1.1010 1.1007 1.0872 1.0903 1.0885 1.1040 1.1029 1.0898 1.0898 1.0898 1.0898 1.0950 1.0950 1.0960 1.0960
irintensity: 0.1397 0.1161 0.0150 0.1795 0.0023 0.2454 0.2098 0.0451 0.0058 0.1506 0.3199 0.0778 0.0547 2.9726 0.0011 0.6619 0.0210 0.3517 0.5944 0.7301 0.7528 0.7053 12.2885 0.1642 3.7116 0.3507 1.4114 15.9007 0.8364 0.0030 0.0027 0.0632 2.7124 3.9213 9.0424 40.6067 12.9977 17.4957 0.0114 0.2734 9.9908 13.3806 0.0560 11.6004 0.6149 3.8088 2.8606 8.9021 27.7041 33.1880 0.1153 0.7900 10.2964 83.7508 2.9569 0.1289 2.0250 1.5678 0.0219 0.0599 0.0367 0.0289 7.3638 37.8794 86.2529 0.8583 10.6516 2.4312 0.0174 3.1047 0.2770 3.3633 36.0047 38.8662 1.3869 2.5356 19.0292 7.1170 29.3797 70.1028 5.5462 44.8118 3.4667 0.2713 1.2560 0.7128 6.1376 1.2338 1.5073 18.2877 5.3363 15.0532 4.5458 4.9188 2.2326 8.9982 11.0785 0.4234 12.9448 3.3676 0.5931 1.7540 24.2952 8.8721 25.8493 0.2697 0.0999 0.0196 4.1788 3.5338 3.8757 0.5479 3.9096 0.0626 19.0652 2.1354 5.0146 2.6808 14.9530 30.1237 79.1645 53.5459 14.6310 13.8606 0.1335 1.6452 1.3049 4.2589 152.8419 2.0248 77.6781 15.3711 9.9235 300.2441 18.0757 22.5633 2.3999 15.1149 26.3624 75.7727 33.0388 4.2084 4.2378 73.8285 55.5522 17.8797 53.7191 49.5136 7.6580 16.5656 14.2887 11.9210 7.5817 9.0576 0.5209 0.3897
temp: 298.150 k
press: 1.00000 atm
elementType: 17 17 7 7 6 6 6 6 6 6 6 6 6 6 6 6 6 6 6 6 6 6 6 6 6 6 1 1 1 1 1 1 1 1 1 1 1 1 1 1 1 1 1 1 1 1 1 1 1 1 1 1 1 1
symmnumber: 1
zpe: 1182230.9 jmol-1
zpe.correction: 0.450288 hartree
zpe.thermalcorrener: 0.476279 hartree
zpe.thermalcorrenthalpy: 0.477223 hartree
zpe.thermalcorrgfe: 0.384778 hartree
zpe.sumelectzpe: -1882.792514 hartree
zpe.sumelectthermal: -1882.766524 hartree
zpe.sumelectthermalent: -1882.765579 hartree
zpe.sumelectthermalfe: -1882.858024 hartree
dipole: 0.0006 -3.9137 0.0001
dipole: 3.9137
quadrupole: -219.7720 -172.7665 -162.3188
quadrupole: -0.0112 -7.4704 -0.0045
quadrupole: -34.8195 12.1859 22.6336 -0.0112 -7.4704 -0.0045
hfenergy: -1883.2428023 hartree
pointgroup: C01 [X(C22H28Cl2N2)]
dipole: -0.0002277 1.5397547 0.0007437 debye
polarizability: 312.2740916|-0.0194683|276.9400125|-32.1767619|0.0352066|220.1860828 unknown
InChI: InChI=1S/C22H28Cl2N2/c23-21-9-5-19(6-10-21)3-1-13-25-15-17-26(18-16-25)14-2-4-20-7-11-22(24)12-8-20/h5-12H,1-4,13-18H2
charge 0 multiplicity 1
54 atoms
Cl 8.935224 -3.440132 -0.818968
Cl -8.934453 -3.441497 0.815535
N  1.455751 2.019492 0.089849
N  -1.456128 2.019771 -0.088519
C  0.656598 3.232633 0.39953
C  0.659489 0.804126 0.394361
C  -0.656876 3.233284 -0.39649
C  -0.660006 0.804813 -0.394952
C  2.771434 2.047033 0.773975
C  -2.771959 2.04839 -0.772318
C  3.739722 0.946871 0.293738
C  -3.740235 0.947731 -0.293186
C  5.168001 1.151561 0.872225
C  -5.168519 1.152774 -0.871527
C  6.121868 0.036689 0.471456
C  -6.122152 0.037324 -0.4718
C  6.355156 -1.068732 1.329212
C  -6.353672 -1.068294 -1.329792
C  6.771212 0.054223 -0.790441
C  -6.772908 0.05441 0.789367
C  7.205927 -2.131414 0.947833
C  -7.204098 -2.131576 -0.949338
C  7.626501 -0.995849 -1.193052
C  -7.627899 -0.996271 1.191047
C  7.828584 -2.076269 -0.313021
C  -7.828216 -2.07685 0.310815
H  1.250714 4.125943 0.128567
H  0.413911 3.295278 1.491286
H  0.425718 0.737699 1.488397
H  1.239882 -0.091987 0.112799
H  -1.250894 4.126266 -0.124233
H  -0.414219 3.297473 -1.488164
H  -0.426241 0.740082 -1.48909
H  -1.240462 -0.091694 -0.114788
H  3.228504 3.035271 0.564469
H  2.659594 1.974495 1.889767
H  -3.228847 3.036422 -0.561464
H  -2.660405 1.977222 -1.888227
H  3.378648 -0.054961 0.595055
H  3.774517 0.958455 -0.812294
H  -3.379057 -0.053784 -0.595433
H  -3.775076 0.958236 0.812853
H  5.100718 1.211726 1.976405
H  5.555585 2.128409 0.520995
H  -5.10119 1.213967 -1.97565
H  -5.556307 2.129216 -0.51941
H  5.869956 -1.102639 2.31209
H  -5.86735 -1.101878 -2.312126
H  6.611863 0.900522 -1.469534
H  -6.614899 0.900832 1.468618
H  7.382776 -2.978397 1.617125
H  -7.379585 -2.978713 -1.618791
H  8.126512 -0.972523 -2.165758
H  -8.129008 -0.97328 2.163194
