program: Gaussian 09
title: 000129067
version: EM64L-G09RevD.01
frameworkgroup: C1[X(C21H33ClO4)]
method: RPBEPBE
basis: SDD
operation: Freq
keyword: #p
keyword: freq=noraman
keyword: PBEPBE/SDD
title: #p freq=noraman PBEPBE/SDD
converged: NO YES NO NO
title: Mulliken charges:
elementType: Cl O O O O C C C C C C C C C C C C C C C C C C C C C H H H H H H H H H H H H H H H H H H H H H H H H H H H H H H H H H
charge: -0.066251 -0.540945 -0.451318 -0.463603 -0.259245 -0.048994 -0.180265 -0.084102 -0.452420 -0.462948 0.000750 -0.516998 -0.282496 -0.206912 -0.442960 -0.452307 -0.408516 -0.399652 -0.252512 -0.383289 -0.128368 -0.221173 -0.476408 -0.383850 -0.469022 0.200782 0.248175 0.280167 0.238539 0.300486 0.241331 0.246878 0.213945 0.215452 0.222257 0.248262 0.189474 0.177229 0.246732 0.209894 0.187366 0.198076 0.194138 0.191735 0.196684 0.280954 0.198678 0.186966 0.369865 0.220119 0.341024 0.225917 0.241844 0.198211 0.200065 0.223383 0.237900 0.234421 0.426853
chargesum: 0.00000
title: Mulliken charges with hydrogens summed into heavy atoms:
elementType: Cl O O O O C C C C C C C C C C C C C C C C C C C C C
charge: -0.066251 -0.171080 -0.110294 -0.036750 -0.259245 0.199181 0.099902 0.154438 -0.151934 0.025261 0.214695 -0.079289 -0.034233 -0.017438 -0.018998 -0.055047 -0.016302 -0.011233 0.028442 0.002356 0.091751 0.004744 -0.036354 0.039598 0.003298 0.200782
polarizability: 2.72545104e+02 -2.14390602e+01 2.49253060e+02 -5.43280646e+00 -2.30416342e+00 2.19190463e+02
1716.lowfreq: -5.5902 -3.3305 -0.0023 -0.0014 -0.0013 6.9698 10.3621 22.2582 27.7654
frequency: 10.1997 21.3252 27.6923 37.6596 48.5806 54.1982 56.5923 76.0907 85.8427 97.3915 104.5490 115.5068 139.3752 146.1913 165.3417 169.8544 178.1687 184.7782 203.9158 215.5619 234.2055 245.6934 253.9289 278.7860 287.7078 308.5000 309.8588 313.9475 323.9993 337.8931 375.6979 401.0924 412.9546 420.4678 428.6599 437.0701 464.3095 480.7618 482.7300 497.6506 517.8014 539.7466 544.7270 567.1436 597.7248 623.6262 666.7845 742.9058 763.4241 787.9829 791.6460 800.1892 819.8136 827.4837 839.4110 847.0245 854.9659 883.0156 888.1924 889.9696 894.3496 913.6362 931.4246 944.4826 954.1673 961.5523 963.6740 975.0147 977.7704 987.1523 993.8504 1009.6519 1041.7344 1049.2395 1052.2838 1056.7714 1060.7659 1066.7832 1073.3726 1090.5851 1093.4828 1105.6417 1115.4069 1118.1038 1130.7191 1134.8489 1147.9836 1157.6685 1172.8300 1179.2267 1186.9773 1191.1228 1195.4705 1208.1719 1215.7757 1227.2573 1243.1010 1249.6494 1251.4137 1255.4796 1256.6877 1262.7451 1276.6747 1281.7923 1283.0879 1288.1934 1293.6069 1302.0532 1304.1577 1305.1985 1309.0337 1324.1618 1328.7857 1330.6218 1333.8100 1336.3683 1340.5938 1342.2013 1348.7369 1352.0899 1354.0697 1363.8556 1366.0094 1376.4137 1383.2775 1443.2510 1450.8541 1459.1666 1459.5917 1462.0378 1463.0349 1464.6637 1465.4720 1470.4867 1478.4260 1639.9595 1667.2333 1674.4788 2920.5424 2951.7027 2953.1069 2960.5816 2962.7502 2963.4346 2965.1007 2965.3737 2971.4592 2978.3375 2984.7140 2989.6077 3000.4233 3004.5242 3019.0236 3020.2898 3023.4186 3024.3534 3027.0394 3036.9471 3037.4189 3038.8698 3050.9232 3055.8869 3061.1618 3062.8066 3071.9157 3073.0203 3078.0449 3091.5476 3098.4303 3557.6998 3602.9344
redmass: 5.1778 4.8576 9.4071 5.3618 3.4945 3.7758 4.4714 4.8392 3.9431 5.0008 4.5833 3.2665 5.4224 4.1825 3.3744 2.4692 4.5251 3.2877 3.6771 3.0958 1.8575 2.8738 2.6296 1.4852 1.9655 2.7405 3.8458 1.4449 2.6335 2.1939 2.8654 2.8746 2.4815 2.9619 3.4658 3.1044 2.5909 2.8650 2.2004 3.4166 3.5061 3.2355 3.3108 2.3250 3.2584 3.0952 3.8778 1.8521 3.8012 1.7023 1.8880 1.8872 2.5186 3.1097 2.1356 2.0415 2.4118 2.7050 2.1825 2.2649 1.6417 1.9571 1.6594 2.3209 1.8121 2.9186 2.1549 1.2512 1.8992 1.1499 2.0385 2.2299 2.6350 2.1613 2.0384 1.1573 2.3711 2.3168 1.5840 2.1521 2.3975 1.8233 2.5686 2.4263 1.7623 2.2609 2.5317 1.6140 1.2667 1.3083 1.5509 1.1688 1.3952 1.3392 1.2092 1.2554 1.2661 1.2613 1.2936 1.3798 1.3034 1.3054 1.2549 1.2679 1.2040 1.2824 1.2851 1.2687 1.3171 1.3479 1.2973 1.2919 1.3161 1.3998 1.3795 1.3985 1.4911 1.4966 1.3492 1.4352 1.3990 1.4802 1.4587 1.5474 1.6674 1.0898 1.0873 1.0904 1.0854 1.0893 1.0874 1.0891 1.1003 1.0819 1.0945 7.6859 6.6573 6.5021 1.0831 1.0679 1.0669 1.0643 1.0597 1.0656 1.0646 1.0649 1.0754 1.0806 1.0642 1.0687 1.0651 1.0703 1.0968 1.0790 1.0977 1.0952 1.1008 1.0966 1.1025 1.0847 1.0953 1.0887 1.0949 1.0947 1.0965 1.0981 1.0894 1.0901 1.0909 1.0662 1.0663
irintensity: 0.0173 0.2638 0.5461 0.0640 0.1553 0.2855 0.3413 4.4669 0.6938 0.6071 0.4448 1.2554 0.4063 5.3293 5.0538 0.6411 1.6015 0.1184 2.1399 10.9996 1.5983 10.7732 0.7593 107.8799 32.1341 4.1871 2.0884 95.8665 24.7775 26.5012 6.4659 2.3524 5.6236 6.1021 8.6347 1.7668 7.1646 7.8896 1.9601 7.7875 6.2187 2.9262 9.1044 11.7503 0.1814 9.1716 5.8022 9.4353 28.6148 0.9717 2.5484 13.5683 10.3480 2.7475 7.3555 5.1133 9.5651 8.2123 24.1230 2.9469 19.1998 5.6035 68.2158 26.3059 17.2920 34.2909 19.1938 31.6432 113.2670 60.6897 8.3058 7.0783 16.8601 16.3642 10.6516 3.7854 67.4978 52.2918 1.5147 5.0564 22.8938 17.0065 17.4316 20.6148 90.0910 94.9808 4.4666 16.8504 0.4180 0.0549 6.6347 49.0416 15.8056 6.2385 25.8279 14.4849 8.2102 7.9690 15.7100 27.5518 1.9970 15.5503 4.3583 24.2078 9.6371 11.8535 6.7276 6.8492 7.1424 13.6918 4.1325 6.7783 2.4646 4.1917 0.4023 12.1707 1.4291 0.4691 2.2954 10.1877 2.9809 1.8426 7.7387 12.6755 14.5469 21.5248 12.3764 10.9467 31.9165 1.4965 5.1859 10.3349 15.9948 18.3733 2.5571 205.8068 3.5897 1.4078 28.4803 18.2642 19.1921 12.7931 34.9885 26.3253 20.4120 29.4000 60.4069 19.8802 411.2570 492.7241 33.4343 38.9201 90.5257 33.2350 15.1088 72.4667 22.1617 14.1260 84.3841 70.5681 2.8493 5.9973 31.6360 6.5902 9.2623 41.2292 45.0365 11.7359 25.5306 5.4306 16.6974
temp: 298.150 k
press: 1.00000 atm
elementType: 17 8 8 8 8 6 6 6 6 6 6 6 6 6 6 6 6 6 6 6 6 6 6 6 6 6 1 1 1 1 1 1 1 1 1 1 1 1 1 1 1 1 1 1 1 1 1 1 1 1 1 1 1 1 1 1 1 1 1
symmnumber: 1
zpe: 1322191.6 jmol-1
zpe.correction: 0.503596 hartree
zpe.thermalcorrener: 0.531696 hartree
zpe.thermalcorrenthalpy: 0.532640 hartree
zpe.thermalcorrgfe: 0.442434 hartree
zpe.sumelectzpe: -1578.921903 hartree
zpe.sumelectthermal: -1578.893803 hartree
zpe.sumelectthermalent: -1578.892859 hartree
zpe.sumelectthermalfe: -1578.983065 hartree
dipole: -0.7495 -2.2785 1.4094
dipole: 2.7820
quadrupole: -182.4518 -161.5838 -163.3107
quadrupole: -5.1982 15.7510 -16.2114
quadrupole: -13.3363 7.5316 5.8048 -5.1982 15.7510 -16.2114
hfenergy: -1579.4254991 hartree
pointgroup: C01 [X(C21H33Cl1O4)]
dipole: 0.2862583 -0.9641046 -0.4319281 debye
polarizability: 269.5784725|20.6236189|250.3638042|-12.9295255|-4.4837259|221.0463501 unknown
InChI: InChI=1S/C21H33ClO4/c22-18-14-20(24)17(12-13-19(23)15-8-4-3-5-9-15)16(18)10-6-1-2-7-11-21(25)26/h1,6,12-13,15-20,23-25H,2-5,7-11,14H2
charge 0 multiplicity 1
59 atoms
Cl -3.374592 -3.268871 2.567457
O  -2.955043 -1.172712 -1.893948
O  2.993147 -0.764056 -2.849427
O  -1.986513 1.257465 -1.990737
O  -3.852477 2.207429 -0.981891
C  -1.42117 -1.739232 1.156366
C  -1.064367 -1.396926 -0.337163
C  -2.096198 -2.188712 -1.216309
C  -2.881031 -2.2277 1.062392
C  -2.927531 -3.049379 -0.233433
C  3.721249 -0.192192 -0.614004
C  -1.149426 -0.583259 2.156912
C  0.38058 -1.691368 -0.670745
C  2.721777 -1.058562 -1.415528
C  5.183748 -0.51556 -1.014377
C  3.532995 -0.358898 0.915561
C  6.193135 0.35363 -0.228207
C  4.538813 0.512041 1.706365
C  1.272812 -0.762355 -1.105949
C  5.999234 0.204089 1.299589
C  -1.969692 0.669447 1.916757
C  -1.496879 1.94161 1.82535
C  -2.395862 3.149369 1.633689
C  -2.018475 4.080755 0.443108
C  -1.65426 3.351003 -0.872261
C  -2.629442 2.249616 -1.266032
H  -0.811601 -2.611182 1.473792
H  -1.245811 -0.320813 -0.501331
H  -1.604441 -2.796866 -1.998889
H  -3.611004 -1.404962 1.052532
H  -2.416772 -4.016781 -0.069161
H  -3.952753 -3.261249 -0.584073
H  3.514679 0.866725 -0.882118
H  -0.06931 -0.33886 2.128024
H  -1.361963 -0.972503 3.174777
H  0.723356 -2.728453 -0.511959
H  2.929525 -2.134864 -1.213363
H  5.382257 -1.58837 -0.801627
H  5.305759 -0.37458 -2.102549
H  2.495962 -0.10103 1.20732
H  3.684008 -1.426312 1.186574
H  7.228106 0.080583 -0.512504
H  6.055299 1.418239 -0.511065
H  4.325342 1.583234 1.507934
H  4.401714 0.35477 2.794119
H  0.943006 0.273946 -1.276264
H  6.696849 0.869942 1.844173
H  6.24847 -0.835859 1.597751
H  -3.694117 -1.606805 -2.384552
H  -3.060431 0.53483 1.8413
H  2.264355 -1.163641 -3.38921
H  -0.41202 2.123301 1.905434
H  -3.433463 2.797701 1.490838
H  -2.388548 3.767791 2.55571
H  -1.152959 4.715116 0.7193
H  -2.871562 4.762218 0.267321
H  -1.61272 4.083858 -1.702959
H  -0.650959 2.895725 -0.8104
H  -2.531485 0.395079 -2.08351
