program: Gaussian 09
title: 000128977
version: EM64L-G09RevD.01
frameworkgroup: C1[X(C5H12N2O4)]
method: RPBEPBE
basis: SDD
operation: Freq
keyword: #p
keyword: freq=noraman
keyword: PBEPBE/SDD
title: #p freq=noraman PBEPBE/SDD
converged: YES YES NO NO
title: Mulliken charges:
elementType: O O O O N N C C C C C H H H H H H H H H H H H
charge: -0.464838 -0.492743 -0.448462 -0.283693 -0.061008 0.051682 -0.440468 -0.005561 -0.359182 -0.353887 -0.301980 0.258856 0.252429 0.202969 0.264117 0.239390 0.225032 0.219175 0.205335 0.207596 0.369345 0.362079 0.353816
chargesum: 0.00000
title: Mulliken charges with hydrogens summed into heavy atoms:
elementType: O O O O N N C C C C C
charge: -0.095492 -0.130663 -0.094646 -0.283693 -0.061008 0.051682 0.070817 0.197408 0.144325 0.090320 0.110950
polarizability: 9.93690013e+01 6.64902335e+00 8.72459299e+01 -2.81834000e+00 -4.67306216e+00 6.73248597e+01
1716.lowfreq: -16.5140 -3.5509 -0.0007 0.0003 0.0007 17.4296 27.2226 55.0566 73.8959
frequency: 25.6290 55.0521 73.8921 91.0089 125.1032 131.3946 194.7773 233.5631 255.5247 275.5663 279.0644 310.3925 329.7614 351.1928 408.4096 445.6828 459.3363 527.1144 560.7895 691.3955 814.1887 826.9117 851.8874 888.0276 955.0680 975.0200 983.9816 1018.0487 1039.1445 1047.3782 1075.3820 1130.5716 1163.5723 1189.7064 1210.0054 1232.9765 1246.5231 1257.1502 1291.1088 1315.2646 1322.7270 1324.2541 1348.3840 1355.3081 1377.2773 1403.3766 1414.4484 1434.8593 1447.9149 1460.4343 1486.6196 2943.9209 2950.8755 2993.3776 3001.6569 3013.8604 3015.8109 3066.1704 3089.5542 3099.3408 3492.8903 3584.1185 3605.3762
redmass: 4.8516 3.4792 4.0814 3.0826 6.7858 3.3271 4.5745 4.5043 1.0775 1.1251 3.8929 4.6360 3.2573 6.3845 3.8831 3.0353 3.0511 1.1282 4.0367 4.2096 1.2247 2.3139 3.7929 2.5018 7.0882 3.0863 5.1058 2.8362 2.3048 1.7932 2.4384 1.4136 1.3789 1.1637 1.2208 1.5119 2.0904 1.1645 1.3536 1.6237 1.6161 1.3675 1.4948 1.6648 1.3789 1.5508 1.4317 1.1231 1.1004 1.0757 1.0807 1.0683 1.0697 1.0566 1.1015 1.0623 1.0644 1.1083 1.1035 1.1015 1.0647 1.0668 1.0669
irintensity: 2.1164 2.7326 6.0037 14.1623 8.3495 2.6188 1.2382 8.7503 132.4243 163.6925 6.7115 15.6841 4.6580 1.9343 13.5361 5.4645 18.1536 160.2447 23.2898 16.1236 3.5795 19.6272 2.7533 44.4370 136.6530 139.6460 62.7384 35.9926 31.4258 20.3244 7.2490 16.4357 20.5482 13.4126 30.6708 9.8683 32.2618 29.1708 21.9499 39.3153 24.6331 9.1369 9.5468 62.9384 6.7563 22.7231 0.9819 13.3891 9.9154 14.6502 3.1682 87.9010 36.1364 27.0719 32.1082 4.3391 46.0355 43.5007 9.7980 8.5852 33.8135 8.4074 11.3101
temp: 298.150 k
press: 1.00000 atm
elementType: 8 8 8 8 7 7 6 6 6 6 6 1 1 1 1 1 1 1 1 1 1 1 1
symmnumber: 1
zpe: 481910.4 jmol-1
zpe.correction: 0.183550 hartree
zpe.thermalcorrener: 0.196670 hartree
zpe.thermalcorrenthalpy: 0.197614 hartree
zpe.thermalcorrgfe: 0.142938 hartree
zpe.sumelectzpe: -607.118452 hartree
zpe.sumelectthermal: -607.105332 hartree
zpe.sumelectthermalent: -607.104388 hartree
zpe.sumelectthermalfe: -607.159064 hartree
dipole: 0.3796 -2.6968 -1.6368
dipole: 3.1774
quadrupole: -60.4085 -75.0132 -64.5279
quadrupole: 6.5120 -3.2077 6.0142
quadrupole: 6.2414 -8.3634 2.1220 6.5120 -3.2077 6.0142
hfenergy: -607.3020016 hartree
pointgroup: C01 [X(C5H12N2O4)]
dipole: 0.2635986 1.08247 0.5670182 debye
dipolederiv: -0.7213748 -0.0872227 0.1962168 -0.0895706 -0.6164523 0.1483474 0.2043153 0.1118229 -0.4332252 -0.7786812 -0.1555046 -0.0921924 -0.2408499 -0.353552 -0.2507666 -0.1251009 -0.2318761 -0.5970864 -0.78865 0.3085928 0.0618255 0.2943037 -0.465112 0.2052984 0.0669606 0.18493 -0.4420639 -0.5781409 0.7180486 -0.3169705 0.0806455 -0.774912 0.2290211 -0.0264716 0.145396 -0.2819151 -0.1528143 -0.1120319 0.0158949 0.2347404 -0.8052467 0.2022196 -0.1581901 0.2362151 -0.3268415 0.0850519 -0.4873353 0.201838 -0.3019544 1.1186064 -0.5707181 0.1635758 -0.5657505 0.173572 0.184487 0.0397388 -0.0209607 0.0480813 0.0767915 0.0779438 -0.0970011 0.0089838 0.1798481 0.6034868 0.0645568 -0.1387261 0.1013524 0.4161568 -0.0362511 -0.1878256 0.0188398 0.2570339 0.3767197 -0.2416468 0.1079436 -0.1652531 0.1795391 0.0071297 0.084851 0.0271082 0.2214259 0.5464564 0.1548995 0.118361 0.1632277 0.2139937 0.2163635 0.1856252 0.2263786 0.3082909 0.6139694 -0.1957851 -0.0425799 -0.2145643 0.4090843 -0.1283127 -0.0642371 -0.0872616 0.3149191 0.0180468 0.0187284 0.0508306 0.049163 -0.0207253 -0.087582 0.0026403 0.005904 0.0901899 0.0437112 -0.0017849 -0.0663814 0.0073222 0.0582316 0.088413 -0.0657762 0.0835831 -0.0060051 -0.0801178 0.0629478 0.0813812 0.118826 -0.105805 -0.0687316 0.1041778 -0.0627192 -0.0591867 -0.002424 -0.0322289 0.0156549 -0.0778412 0.0444369 0.0253554 0.0711872 0.0175787 0.0967648 0.054166 0.0477866 -0.0006018 0.0628828 0.0468215 0.0192068 -0.0453095 0.0122152 -0.1179283 -0.0126089 0.042614 0.0059483 0.0271421 -0.0884423 -0.0838463 -0.0006022 -0.103523 0.0063968 -0.0650825 -0.0688247 0.0654706 -0.0558483 0.0236532 0.0141749 0.1166955 0.0283122 -0.0487133 -0.1767103 -0.0595473 0.0336973 -0.1110001 -0.027734 0.0316934 0.0822873 0.0451827 0.0201451 -0.0122759 0.0375259 -0.0448431 0.0431814 0.0212471 0.037177 -0.0795972 0.0229475 -0.1825596 0.2495404 -0.0456411 -0.068294 -0.0502832 0.3611241 -0.0765745 -0.073872 -0.0782328 0.2738567 0.2886466 0.0231579 -0.0990457 0.0744909 0.1853081 0.1442202 -0.1096531 0.1120185 0.2554879 0.3045985 -0.0310439 -0.0644671 0.0018058 0.1029873 -0.1437812 -0.0486794 -0.1580532 0.2975941 unknown
polarizability: 95.2617027|-6.9801042|88.5876528|6.5801575|-8.5846823|70.0904353 unknown
InChI: InChI=1S/C5H12N2O4/c8-2-1-7(6-11)3-5(10)4-9/h5,8-10H,1-4H2
charge 0 multiplicity 1
23 atoms
O  2.403186 0.957007 -1.005503
O  3.111332 0.475571 1.543481
O  -3.398802 1.984297 -0.220712
O  0.05411 -2.593229 0.510901
N  -0.863409 -0.739723 -0.374271
N  -1.02794 -1.908973 0.352239
C  0.424406 -0.373357 -1.002356
C  1.392111 0.414544 -0.091476
C  -2.098116 0.030753 -0.601745
C  2.079009 -0.433061 0.990439
C  -2.091726 1.400121 0.101476
H  0.922292 -1.300155 -1.342139
H  0.208452 0.259895 -1.879962
H  0.852329 1.250015 0.406589
H  -2.933661 -0.573596 -0.21162
H  -2.252334 0.186554 -1.685734
H  2.541745 -1.331309 0.538118
H  1.362063 -0.746229 1.771362
H  -1.266116 2.03629 -0.282108
H  -1.961834 1.261313 1.195361
H  3.17476 1.218134 -0.432644
H  3.679637 -0.008994 2.189925
H  -3.477996 2.879932 0.191878
