program: Gaussian 09
title: 000128984
version: EM64L-G09RevD.01
frameworkgroup: C1[X(C13H13N3O4)]
method: RPBEPBE
basis: SDD
operation: Freq
keyword: #p
keyword: freq=noraman
keyword: PBEPBE/SDD
title: #p freq=noraman PBEPBE/SDD
converged: YES YES NO NO
title: Mulliken charges:
elementType: O O O O N N N C C C C C C C C C C C C C H H H H H H H H H H H H H
charge: -0.310803 -0.444999 -0.159947 -0.247898 -0.070620 0.009742 -0.062825 -0.154966 -0.513614 -0.090325 -0.075231 -0.543036 0.187035 0.228007 0.221044 -0.336313 -0.322865 -0.222396 -0.219281 -0.220191 0.281707 0.227052 0.250406 0.224659 0.276041 0.275392 0.237660 0.346529 0.268465 0.261789 0.234141 0.232667 0.232975
chargesum: 0.00000
title: Mulliken charges with hydrogens summed into heavy atoms:
elementType: O O O O N N N C C C C C C C C C C C C C
charge: -0.310803 -0.098469 -0.159947 -0.247898 -0.070620 0.009742 -0.062825 0.126742 -0.036157 0.134334 0.200810 -0.029985 0.187035 0.228007 0.221044 -0.067848 -0.061076 0.011745 0.013386 0.012784
polarizability: 2.37799980e+02 -1.29876146e+01 1.46654858e+02 -1.32606365e+01 2.06201530e+01 1.31782712e+02
1716.lowfreq: -0.7525 -0.0003 0.0004 0.0007 4.2832 7.0192 17.5677 29.3553 39.7544
frequency: 17.3101 29.2704 39.7474 57.8217 64.5227 80.2578 99.6106 117.2816 156.7542 167.6785 174.4363 240.3345 293.3416 306.7017 316.4543 326.1489 357.4564 379.2404 401.5938 406.6276 424.1324 437.8730 442.7740 488.2131 503.5299 557.1653 589.6880 605.0388 613.7966 662.1782 676.7156 698.2927 719.0557 792.5567 795.1643 804.4847 831.4332 862.3188 885.4438 895.2326 917.3000 953.7486 970.4136 990.7309 994.7439 995.8566 1008.8793 1023.8183 1039.5119 1047.0466 1053.8108 1087.4617 1109.4197 1138.8270 1153.1650 1174.6680 1183.0502 1196.4356 1212.0008 1227.5263 1242.5768 1252.5371 1275.2510 1299.0448 1307.2206 1316.6161 1319.2478 1329.2794 1361.3155 1377.4223 1391.6573 1427.2343 1439.1249 1462.7785 1478.3643 1586.8064 1612.4405 1632.7284 1660.8129 2041.1146 2975.7608 2981.3031 2997.3651 3003.0426 3009.5053 3063.1614 3098.6693 3131.8473 3144.7126 3156.9140 3168.7902 3183.0693 3562.1925
redmass: 5.1871 6.4008 6.9592 7.4093 6.3691 8.5073 6.4061 6.8805 5.9984 7.0148 6.8669 6.2362 5.0104 1.3556 5.0164 4.6595 3.6834 3.7417 2.8057 2.6963 4.3771 4.0516 4.1385 13.5885 4.5461 5.0278 5.9289 6.3895 6.4347 6.5287 5.1807 1.6047 4.8895 7.2132 2.1882 2.9660 3.6195 1.2471 1.8808 3.9698 3.3578 1.4264 3.3002 6.1372 1.3914 4.5164 1.3340 2.5620 2.1867 2.9195 2.1539 1.6447 2.4060 1.7095 1.6908 1.0569 1.1325 1.3575 1.3491 1.4172 3.1170 9.2788 1.5741 1.2694 1.3210 1.3303 1.5117 1.4504 1.4510 1.5522 10.0701 1.0816 2.2545 1.0879 2.2904 6.5619 6.0904 11.3385 10.9867 13.6474 1.0809 1.0807 1.0649 1.0794 1.0715 1.1017 1.0964 1.0856 1.0892 1.0941 1.0985 1.0970 1.0662
irintensity: 1.5778 1.7641 2.3272 2.0519 1.5862 0.9534 0.5407 0.9045 0.8102 0.3106 1.9666 5.7010 11.3711 132.8824 7.4100 31.1363 47.9577 11.0804 0.0399 6.0357 0.7497 5.3936 2.8230 4.9111 10.8388 20.9306 4.6714 0.3922 0.6095 7.4964 18.7290 85.1609 15.7097 10.7826 19.8059 5.2488 20.9051 0.5378 9.7590 9.1514 22.0240 2.0079 24.2860 2.2173 0.2722 32.1394 0.1144 86.9138 33.9703 230.4532 86.2678 15.7204 22.2462 1.0592 98.5374 0.2923 38.7900 10.6844 7.1133 73.5108 151.3107 116.3018 20.8581 4.8694 64.6189 6.5116 35.9992 14.7042 23.9402 6.4157 3.2851 19.3041 17.4290 11.8621 6.1476 23.3483 14.8768 191.2331 109.5948 314.0093 56.4309 6.7072 5.3355 8.6471 44.4947 23.2356 7.3156 0.3847 9.9829 16.1445 23.8042 5.6129 7.2552
temp: 298.150 k
press: 1.00000 atm
elementType: 8 8 8 8 7 7 7 6 6 6 6 6 6 6 6 6 6 6 6 6 1 1 1 1 1 1 1 1 1 1 1 1 1
symmnumber: 1
zpe: 646497.8 jmol-1
zpe.correction: 0.246238 hartree
zpe.thermalcorrener: 0.264453 hartree
zpe.thermalcorrenthalpy: 0.265397 hartree
zpe.thermalcorrgfe: 0.197462 hartree
zpe.sumelectzpe: -966.814374 hartree
zpe.sumelectthermal: -966.796159 hartree
zpe.sumelectthermalent: -966.795215 hartree
zpe.sumelectthermalfe: -966.863150 hartree
dipole: 3.4412 1.4373 0.2656
dipole: 3.7387
quadrupole: -75.2219 -130.2641 -116.9009
quadrupole: 4.2524 -4.6779 9.3298
quadrupole: 32.2404 -22.8018 -9.4386 4.2524 -4.6779 9.3298
hfenergy: -967.0606121 hartree
pointgroup: C01 [X(C13H13N3O4)]
dipole: 1.3970695 0.4599801 0.0142565 debye
polarizability: 234.9352168|-22.3770617|157.1814489|-7.2163574|16.5893393|124.1208837 unknown
InChI: InChI=1S/C13H13N3O4/c14-16-15-10-6-9(17)7-11(18)12(10)20-13(19)8-4-2-1-3-5-8/h1-5,9-10,12,17H,6-7H2
charge 0 multiplicity 1
33 atoms
O  -0.079979 0.008623 -0.050261
O  4.050308 -0.455956 1.792997
O  0.891198 -2.271351 1.162958
O  -0.960632 -1.563952 -1.532948
N  1.901624 1.874196 -1.179819
N  0.892479 2.605451 -0.939443
N  0.01069 3.396492 -0.886641
C  2.22195 0.754457 -0.232786
C  3.668553 0.321078 -0.536478
C  4.10313 -0.850344 0.369212
C  1.261472 -0.442141 -0.426804
C  3.157671 -2.062389 0.254848
C  1.694331 -1.661644 0.424892
C  -1.152734 -0.690493 -0.655284
C  -2.471665 -0.235177 -0.146588
C  -3.635281 -0.831682 -0.699917
C  -2.592751 0.760428 0.857504
C  -4.910701 -0.433933 -0.252785
C  -3.872105 1.155145 1.300413
C  -5.031243 0.5606 0.747654
H  2.141767 1.097213 0.818234
H  3.745264 0.023688 -1.600303
H  4.341059 1.187244 -0.396661
H  5.132677 -1.162122 0.09751
H  1.258069 -0.754766 -1.49235
H  3.410259 -2.815922 1.017842
H  3.284376 -2.522354 -0.745775
H  4.73096 0.243448 1.964664
H  -3.516281 -1.599509 -1.471386
H  -1.690664 1.20952 1.280796
H  -5.807807 -0.895062 -0.67927
H  -3.967191 1.924155 2.074295
H  -6.023403 0.869757 1.095179
