program: Gaussian 09
title: 000128953
version: EM64L-G09RevD.01
frameworkgroup: C1[X(C6H12O4)]
method: RPBEPBE
basis: SDD
operation: Freq
keyword: #pfreq=noraman
keyword: PBEPBE/SDD
title: #p freq=noraman PBEPBE/SDD
converged: YES YES NO NO
title: Mulliken charges:
elementType: O O O O C C C C C C H H H H H H H H H H H H
charge: -0.469686 -0.484608 -0.443838 -0.180270 -0.464708 -0.102435 -0.070592 -0.483156 -0.322882 -0.036986 0.215253 0.220947 0.266517 0.215847 0.237167 0.234422 0.192799 0.209338 0.346543 0.387920 0.173554 0.358854
chargesum: 0.00000
title: Mulliken charges with hydrogens summed into heavy atoms:
elementType: O O O O C C C C C C
charge: -0.123142 -0.096688 -0.084984 -0.180270 -0.028509 0.164081 0.145255 -0.011567 0.079255 0.136567
polarizability: 9.97805863e+01 -1.56724580e+00 7.00519697e+01 -3.24427852e+00 -1.85824722e+00 6.47321227e+01
1716.lowfreq: -20.4658 -6.9359 0.0005 0.0008 0.0010 14.4511 39.7171 56.3154 84.8202
frequency: 39.4827 56.2835 84.7034 100.5089 110.4066 141.2749 213.3172 252.5695 282.4912 316.9176 339.4349 412.0530 451.5545 492.5038 505.0494 518.4983 612.3487 658.9079 748.4351 807.0750 830.2332 899.1311 945.2314 985.4734 1015.1165 1028.3699 1040.0860 1062.4779 1090.9569 1098.8626 1149.3424 1161.1200 1186.2732 1239.5073 1253.7291 1292.2040 1304.2175 1320.7450 1337.2039 1346.5321 1375.6820 1381.5101 1389.8848 1390.0522 1427.8106 1453.7637 1460.7207 1652.0242 2880.0875 2946.7982 2967.6784 2971.4382 2976.3015 3028.3632 3042.1961 3066.4733 3073.7263 3475.5805 3520.9283 3556.7269
redmass: 6.0727 5.8895 5.7915 2.3528 4.2213 2.6886 3.7713 5.1228 4.1887 1.9202 1.6590 2.0714 2.2066 2.7872 1.2457 3.3406 2.9288 1.1229 1.8721 2.6127 2.8575 1.5441 2.3229 3.0448 2.4361 2.5698 2.4695 2.1581 2.9597 2.7461 1.2818 1.3454 1.2481 1.2969 1.2195 1.3246 1.3466 1.2225 1.2943 1.4039 1.2699 1.1539 1.3209 1.3097 1.0890 1.0866 1.0908 8.1346 1.0858 1.0692 1.0615 1.0619 1.0821 1.0985 1.0958 1.0911 1.0952 1.0657 1.0649 1.0662
irintensity: 6.6119 10.2068 2.6107 3.4886 9.3742 9.2736 2.8403 0.2264 1.7518 18.1110 94.2555 11.9611 16.8613 14.7426 129.2099 70.6615 34.5340 188.5994 1.9343 7.3978 62.9688 9.7965 43.9958 47.4114 13.8129 56.4785 62.6343 35.4015 39.3386 14.7440 35.4472 11.9335 22.0032 20.5490 24.2142 38.3756 9.1347 10.1502 17.2258 13.0363 69.2595 17.2554 11.0086 3.6332 9.4960 5.3521 11.2079 163.9527 96.9325 37.2322 4.5863 39.0163 44.2078 22.6762 1.1951 33.1489 43.2569 61.6629 13.3426 7.9964
temp: 298.150 k
press: 1.00000 atm
elementType: 8 8 8 8 6 6 6 6 6 6 1 1 1 1 1 1 1 1 1 1 1 1
symmnumber: 1
zpe: 471139.5 jmol-1
zpe.correction: 0.179448 hartree
zpe.thermalcorrener: 0.191322 hartree
zpe.thermalcorrenthalpy: 0.192266 hartree
zpe.thermalcorrgfe: 0.140756 hartree
zpe.sumelectzpe: -535.866531 hartree
zpe.sumelectthermal: -535.854656 hartree
zpe.sumelectthermalent: -535.853712 hartree
zpe.sumelectthermalfe: -535.905223 hartree
dipole: -0.8236 -1.9938 0.1636
dipole: 2.1634
quadrupole: -97.5409 -58.1045 -55.8298
quadrupole: 2.6588 2.5110 1.2636
quadrupole: -27.0491 12.3872 14.6619 2.6588 2.5110 1.2636
hfenergy: -536.0459785 hartree
pointgroup: C01 [X(C6H12O4)]
dipole: 0.3310254 0.7810513 0.0696632 debye
dipolederiv: -0.8125388 0.0616441 0.0479431 0.0172672 -0.6405413 0.251301 0.0790329 0.2789629 -0.3004979 -0.6636474 -0.0648766 0.1169625 -0.0589014 -0.7238154 -0.1408295 0.1102732 -0.1661933 -0.4728357 -0.8493657 -0.1742171 -0.1003949 -0.2227273 -0.4580634 0.1452188 -0.1491959 0.1355296 -0.4475715 -0.9395368 0.1002423 -0.0710042 0.1417735 -0.3611521 -0.0524937 -0.2336509 -0.0184448 -0.4308172 -0.2744851 -0.0024176 0.0120151 0.0082216 -0.0728865 0.0232767 0.0790115 -0.0274268 0.0878736 0.5837666 -0.0359902 -0.0153556 -0.0118307 0.4716934 -0.1958865 -0.013093 -0.2456433 0.3419455 0.2639583 -0.0186484 -0.054924 0.1058697 0.4658097 0.1233649 -0.1162792 0.1313373 0.3805955 -0.4804039 0.095442 0.0619711 0.2770881 -0.1434847 -0.0456935 0.0776536 -0.0604728 0.0613688 0.5313805 0.209574 -0.0153527 0.1106926 0.3950761 -0.0666545 0.0099986 -0.0317112 0.3580933 1.1264658 -0.2449098 0.1290813 -0.4382404 0.4076587 0.2651414 0.0983826 0.2686503 0.5823119 0.0722688 0.038804 -0.0233752 0.0027524 -0.0469578 0.0928603 0.0149044 0.1283909 -0.0271318 0.0321743 -0.0454214 -0.0590089 -0.0170686 0.0166193 -0.0705609 -0.0435476 -0.1084477 -0.0890216 0.0788865 0.0051144 -0.0063451 0.0154213 -0.0058393 -0.0462033 -0.0106361 -0.0147687 -0.0807817 0.0190507 -0.0093217 -0.0074221 -0.008957 -0.0329819 0.0552041 0.0288823 0.0151191 -0.1942098 0.0283695 -0.0050275 0.0077265 -0.0020054 0.078172 -0.0406812 -0.0018711 -0.0810416 -0.0949129 0.0945295 0.0158957 -0.0075771 -0.0010169 -0.0124309 0.0866711 0.0344164 0.0982681 0.0300952 -0.0322238 -0.0649417 0.0597845 -0.0461061 0.0023965 0.0757127 0.0453314 0.1369221 -0.1650836 0.0575253 -0.0032533 0.0135259 -0.0120331 -0.0732303 -0.0834221 0.0157339 -0.129237 0.0036448 0.3607639 -0.0323194 -0.0444985 -0.0606866 0.2340527 -0.1493874 -0.0717152 -0.0769071 0.1005357 0.3950945 0.1265371 -0.0482446 0.1227529 0.324171 0.0169188 -0.0190783 0.0281002 0.2489913 0.0017932 -0.0186843 -0.0899231 0.0324871 -0.0062679 -0.1463018 -0.0410617 -0.1593551 -0.1683952 0.4061738 0.0667752 0.0944161 0.0452469 0.1820022 -0.0975555 0.1065083 -0.1016311 0.2758034 unknown
polarizability: 99.8761471|-1.7852142|70.0168916|2.5009879|1.9552738|64.67164 unknown
InChI: InChI=1S/C6H12O4/c7-2-1-5(9)3-6(10)4-8/h2,5-6,8-10H,1,3-4H2
charge 0 multiplicity 1
22 atoms
O  0.807862 -1.251962 0.488794
O  -1.760755 -1.162262 -0.603952
O  -4.219088 -0.074221 0.092278
O  4.346702 -0.136363 0.017132
C  -0.4813 0.871151 0.152232
C  0.741149 0.028531 -0.269934
C  -1.764452 0.006473 0.299875
C  2.076052 0.788382 -0.149758
C  -3.04148 0.772914 -0.071382
C  3.253472 -0.0735 -0.589267
H  -0.630465 1.656253 -0.617259
H  -0.276931 1.389398 1.110764
H  0.597731 -0.321102 -1.306564
H  -1.853476 -0.353391 1.346193
H  2.25348 1.153577 0.879686
H  2.040424 1.679966 -0.812072
H  -2.947414 1.131679 -1.120123
H  -3.187908 1.639307 0.595624
H  1.040781 -1.069941 1.434999
H  -1.03515 -1.767208 -0.287755
H  3.080457 -0.655868 -1.530553
H  -4.002189 -0.933014 -0.359059
