program: Gaussian 09
title: 000128996
version: EM64L-G09RevD.01
frameworkgroup: C1[X(C21H30FN3O2)]
method: RPBEPBE
basis: SDD
operation: Freq
keyword: #p
keyword: freq=noraman
keyword: PBEPBE/SDD
title: #p freq=noraman PBEPBE/SDD
converged: YES YES NO NO
title: Mulliken charges:
elementType: F O O N N N C C C C C C C C C C C C C C C C C C C C C H H H H H H H H H H H H H H H H H H H H H H H H H H H H H H
charge: -0.195197 -0.332603 -0.219870 -0.170643 -0.085270 -0.455024 -0.015617 -0.424661 -0.466232 -0.396233 -0.409805 -0.376010 -0.386208 -0.398045 -0.337989 -0.343632 0.303381 -0.349548 -0.412698 -0.539107 0.127901 0.298333 -0.309134 -0.321516 -0.386199 -0.369367 0.334307 0.256021 0.248658 0.188809 0.202923 0.213648 0.200905 0.197896 0.177106 0.206219 0.198483 0.192870 0.209541 0.260326 0.181791 0.222377 0.209069 0.195644 0.182928 0.207693 0.288639 0.225872 0.188158 0.217415 0.228672 0.225388 0.247358 0.253677 0.284873 0.260441 0.263288
chargesum: 0.00000
title: Mulliken charges with hydrogens summed into heavy atoms:
elementType: F O O N N N C C C C C C C C C C C C C C C C C C C C C
charge: -0.195197 -0.332603 -0.219870 -0.170643 -0.085270 -0.166385 0.240404 0.012806 -0.049661 0.002567 -0.026480 0.015342 0.083659 0.006122 0.066724 0.046989 0.303381 0.064482 0.033389 -0.066360 0.127901 0.298333 -0.055457 -0.036643 -0.125758 -0.106079 0.334307
polarizability: 3.42152280e+02 1.43850429e+01 2.05671877e+02 -1.59473344e+01 8.39237359e+00 2.16272938e+02
1716.lowfreq: -0.0009 0.0002 0.0009 4.2238 5.2834 12.9459 13.3834 22.1005 28.1592
frequency: 12.9808 21.0372 24.0225 32.2484 44.1645 53.4907 63.0558 68.0250 77.5225 93.6906 99.7666 105.5237 136.1270 158.2054 196.5775 207.8847 211.1075 232.9646 242.9891 281.1849 284.0655 292.8589 298.9988 315.0809 352.7735 363.6178 367.9744 376.7770 395.9172 410.3866 411.4871 423.7245 461.4148 469.8884 472.0795 479.0365 486.1019 514.4616 556.1488 571.1613 590.9053 624.5932 633.4448 646.3015 694.5790 709.4871 723.8352 763.4936 773.0174 781.7648 794.6123 815.2780 818.7204 822.6585 832.6813 842.3001 844.2720 864.2323 877.0571 885.8544 922.9824 946.6954 955.2095 960.5263 968.7097 990.1864 998.8607 1004.9188 1010.3666 1020.1807 1021.2091 1043.9274 1051.5734 1054.1304 1066.1302 1082.9732 1086.7717 1102.2656 1106.6295 1110.5250 1113.5077 1133.7831 1144.4448 1151.5390 1157.1166 1163.6881 1180.3052 1201.1145 1202.2455 1206.9378 1222.2031 1238.9472 1243.3030 1246.5104 1256.5744 1269.1468 1276.6962 1285.1207 1294.7586 1300.8381 1307.5937 1320.1956 1323.9276 1328.4709 1334.3368 1337.8118 1342.4614 1345.0867 1349.7978 1351.6890 1363.8867 1370.6738 1375.2037 1380.8031 1389.1375 1396.7617 1410.4876 1434.7429 1451.9380 1455.8450 1457.3670 1459.3988 1461.0325 1463.9278 1466.1752 1469.7609 1471.6779 1475.4680 1484.8889 1491.6964 1492.7252 1573.9337 1588.5320 1601.2523 1613.5249 2848.0864 2870.6626 2891.6188 2944.8458 2947.7829 2956.3761 2964.0611 2964.1195 2969.7395 2975.2621 2980.1389 2993.3103 3002.9106 3017.7440 3021.7407 3024.2391 3024.5950 3027.4620 3035.6522 3041.8657 3056.0943 3058.5443 3059.6777 3070.8348 3091.1320 3155.5575 3158.2034 3178.1798 3181.1948 3585.2268
redmass: 5.7028 6.8502 5.0979 3.7442 3.2181 3.9581 4.5151 4.3140 4.1206 4.0505 4.6636 9.4935 3.6417 2.7577 2.8138 2.5114 2.5497 2.1193 3.3331 3.5707 5.7135 2.5900 2.3251 3.8437 2.4558 3.1283 1.9239 3.4051 2.0253 1.8884 2.9386 3.8622 2.6887 2.8994 3.4090 3.1320 2.6594 3.5690 2.8081 3.4578 4.5405 7.1727 2.3957 2.3860 2.5423 9.3199 3.6110 3.7294 1.5836 3.1977 3.0810 2.0869 1.4394 2.9587 1.6784 1.4741 1.5755 2.3471 2.1827 2.2538 1.4379 2.1605 1.9336 2.5658 2.2355 1.3710 2.4125 2.6468 2.8343 2.0978 2.1428 1.4809 1.7673 1.6458 2.1783 2.1114 1.7099 2.1998 1.3838 1.0393 2.4016 2.3771 2.7124 1.8711 1.4326 2.2130 1.7395 1.1232 1.7169 1.9128 2.1790 1.5236 2.0291 1.4761 1.3007 1.3304 1.4970 1.3165 1.2790 1.5903 1.2691 1.4484 1.3468 1.3364 1.4305 1.4753 1.4310 1.4756 1.3486 1.4427 1.4258 1.4755 1.3971 5.9325 1.7115 1.4205 4.0664 1.1088 1.0819 1.0933 1.1049 1.0881 1.0905 1.0897 1.1041 1.1001 1.1113 1.2370 1.1008 2.5531 1.7020 7.9020 6.2642 7.1093 7.2966 1.0702 1.0707 1.0669 1.0675 1.0669 1.0692 1.0614 1.0612 1.0641 1.0641 1.0621 1.0912 1.0681 1.0889 1.0895 1.0892 1.0929 1.0942 1.1010 1.1015 1.0924 1.0978 1.0905 1.1017 1.0923 1.0886 1.0891 1.0964 1.0974 1.0762
irintensity: 0.0205 0.3083 0.8851 0.3703 0.1500 0.3304 2.0549 10.2931 5.0740 1.5675 0.6327 3.6821 1.5336 0.8342 0.2433 4.0403 2.0942 3.2211 2.8148 4.2603 0.8175 9.4675 6.7689 7.8919 13.2256 19.2338 10.7789 18.5148 28.7641 4.6676 0.0211 5.3972 4.3606 1.6898 0.8474 6.9504 5.4130 4.4471 17.6763 23.9241 4.2742 0.7944 3.5541 3.6150 4.8983 14.6229 0.1148 10.5080 0.5054 1.2906 9.4242 16.9762 19.0945 3.7491 1.3111 58.2505 4.2743 6.3395 7.0516 0.7903 10.5044 10.6675 18.8226 37.4228 14.7942 2.3449 92.0829 4.7431 2.7698 12.4097 17.2304 0.6316 2.3337 0.4679 1.6700 3.7905 1.0003 4.6569 12.3289 1.5162 7.9802 63.0219 56.5167 10.8528 81.7978 3.0173 4.2577 12.8370 0.7077 59.1305 163.1843 18.4625 172.2357 78.9763 15.5763 16.2499 20.2202 15.0822 2.6451 47.6057 18.6229 2.4948 22.0934 3.2172 1.4140 40.6412 23.6256 1.9442 14.9883 3.5960 7.5634 2.2900 3.0117 16.9140 35.3578 1.5182 16.6700 27.0584 11.8056 14.9519 28.0642 1.3011 7.0131 43.3275 24.4268 20.2982 28.5686 198.4753 9.5611 39.0257 394.4834 124.8007 265.8749 90.5107 42.6686 64.5983 54.7205 87.2534 45.0514 39.6004 76.6909 63.8547 19.3432 28.3794 28.3542 31.1343 19.9527 13.3481 25.5391 58.5723 49.0336 90.6416 24.6620 29.2403 110.7534 60.4042 43.0422 26.2425 27.8818 7.0910 6.7744 0.1060 3.4280 4.4735 6.3061
temp: 298.150 k
press: 1.00000 atm
elementType: 9 8 8 7 7 7 6 6 6 6 6 6 6 6 6 6 6 6 6 6 6 6 6 6 6 6 6 1 1 1 1 1 1 1 1 1 1 1 1 1 1 1 1 1 1 1 1 1 1 1 1 1 1 1 1 1 1
symmnumber: 1
zpe: 1267074.0 jmol-1
zpe.correction: 0.482603 hartree
zpe.thermalcorrener: 0.508861 hartree
zpe.thermalcorrenthalpy: 0.509805 hartree
zpe.thermalcorrgfe: 0.422588 hartree
zpe.sumelectzpe: -1230.726398 hartree
zpe.sumelectthermal: -1230.700141 hartree
zpe.sumelectthermalent: -1230.699196 hartree
zpe.sumelectthermalfe: -1230.786414 hartree
dipole: 1.7304 1.3083 -5.2251
dipole: 5.6575
quadrupole: -162.1046 -164.0841 -162.1083
quadrupole: -19.4870 7.7744 7.1121
quadrupole: 0.6611 -1.3184 0.6573 -19.4870 7.7744 7.1121
hfenergy: -1231.2090012 hartree
pointgroup: C01 [X(C21H30F1N3O2)]
dipole: -0.691905 0.4752234 2.0614931 debye
polarizability: 342.4622619|-13.1315244|205.7681633|-15.6498697|-8.728614|215.8666694 unknown
InChI: InChI=1S/C21H30FN3O2/c22-18-10-8-17(9-11-18)20(26)7-4-12-24-13-15-25(16-14-24)21(27)23-19-5-2-1-3-6-19/h8-11,19,23H,1-7,12-16H2
charge 0 multiplicity 1
57 atoms
F  -9.488011 1.809315 0.223433
O  4.576957 -1.505203 -1.646265
O  -3.633596 -0.196508 -1.457123
N  2.964515 -1.18371 0.021502
N  0.148755 -1.182894 0.654513
N  5.168064 -0.284596 0.24207
C  6.524757 -0.003947 -0.281897
C  6.512123 1.145967 -1.32783
C  7.474714 0.335837 0.892886
C  6.18403 2.512599 -0.684683
C  7.167403 1.713342 1.535564
C  7.158558 2.83991 0.472892
C  2.039101 -2.112327 -0.659424
C  2.503012 -0.740763 1.346949
C  0.619441 -1.526227 -0.715373
C  1.064441 -0.187039 1.260307
C  4.254097 -1.015984 -0.512373
C  -1.263158 -0.719733 0.692692
C  -2.269503 -1.853056 0.400205
C  -3.729189 -1.425076 0.65172
C  -4.294614 -0.476593 -0.413712
C  -5.667032 0.104141 -0.208537
C  -6.473516 -0.211676 0.919286
C  -6.172204 1.002879 -1.18921
C  -7.756311 0.35355 1.070717
C  -7.448091 1.58017 -1.054958
C  -8.211494 1.239016 0.077683
H  6.865573 -0.92654 -0.787025
H  5.787916 0.892259 -2.122377
H  7.51432 1.191732 -1.802236
H  8.508469 0.354637 0.495305
H  7.436534 -0.46996 1.651948
H  6.221391 3.310177 -1.451424
H  5.144352 2.494389 -0.297371
H  6.181327 1.690162 2.048306
H  7.915126 1.930526 2.322649
H  6.891224 3.806355 0.943037
H  8.183564 2.955296 0.062676
H  2.007329 -3.078585 -0.112236
H  2.438021 -2.293159 -1.670213
H  3.147356 0.06232 1.744603
H  2.519048 -1.587719 2.066638
H  -0.056936 -2.279499 -1.154255
H  0.612475 -0.627292 -1.382027
H  1.084578 0.767292 0.672349
H  0.708947 0.047641 2.281632
H  4.926997 0.081503 1.160677
H  -1.440627 0.125092 -0.016454
H  -1.451777 -0.337705 1.716726
H  -2.01892 -2.713707 1.048217
H  -2.177977 -2.18238 -0.650476
H  -3.826113 -0.951031 1.650064
H  -4.385647 -2.320081 0.680089
H  -6.11087 -0.902099 1.686668
H  -5.538013 1.231494 -2.051618
H  -8.392512 0.122132 1.929534
H  -7.851007 2.274259 -1.797841
