program: Gaussian 09
title: 000128962
version: EM64L-G09RevD.01
frameworkgroup: C1[X(C18H20N4O)]
method: RPBEPBE
basis: SDD
operation: Freq
keyword: #p
keyword: freq=noraman
keyword: PBEPBE/SDD
title: #p freq=noraman PBEPBE/SDD
converged: YES YES NO NO
title: Mulliken charges:
elementType: O N N N N C C C C C C C C C C C C C C C C C C H H H H H H H H H H H H H H H H H H H H
charge: -0.308170 -0.190822 -0.369689 -0.085492 -0.674438 0.328007 -0.092741 0.170919 0.258820 0.253908 -0.033612 -0.397048 -0.335905 -0.369419 0.118811 -0.376141 -0.279372 -0.338870 -0.338165 -0.285303 -0.224825 -0.618652 -0.617665 0.251168 0.205911 0.176057 0.255511 0.189024 0.376805 0.288941 0.232767 0.190228 0.254636 0.329344 0.327232 0.231228 0.233538 0.235998 0.183589 0.216826 0.184345 0.219783 0.222931
chargesum: 0.00000
title: Mulliken charges with hydrogens summed into heavy atoms:
elementType: O N N N N C C C C C C C C C C C C C C C C C C
charge: -0.308170 -0.190822 0.007116 -0.085492 -0.017861 0.328007 -0.092741 0.170919 0.258820 0.253908 -0.033612 0.060032 0.095663 -0.180395 0.118811 -0.087200 -0.046605 -0.148642 -0.083529 -0.054075 0.008713 0.017761 0.009393
polarizability: 3.15497536e+02 -1.80870810e+01 3.22796823e+02 -1.75507303e+01 -8.26703766e+00 1.14238613e+02
1716.lowfreq: -8.3142 -3.4998 0.0004 0.0007 0.0011 3.1032 19.2442 25.8898 30.4596
frequency: 19.1866 25.6380 30.3341 57.9111 63.9509 84.2853 92.0053 118.7901 130.8600 165.0454 185.3140 214.1483 220.4178 239.5839 246.5803 272.7212 317.1710 321.4753 335.7004 351.0588 358.7378 369.3652 381.5244 413.2303 425.0696 437.6794 459.3791 483.4240 501.7604 512.7754 528.9043 549.6829 576.7902 577.6352 620.6980 647.0853 668.9034 706.1335 719.1180 752.4468 754.9073 766.8948 774.7355 813.6172 828.5262 832.5644 840.5496 862.6286 893.0323 921.3555 930.6483 932.8785 947.7593 990.0234 1000.5178 1012.2048 1023.1691 1030.3248 1034.8046 1060.4603 1077.3336 1082.1351 1091.5081 1111.5039 1123.4333 1138.3992 1164.6420 1169.8102 1190.2599 1196.7958 1213.9919 1248.6827 1262.5264 1267.7413 1273.6218 1277.6424 1303.6032 1310.8682 1324.4964 1353.4860 1369.1408 1382.9862 1411.2511 1417.7214 1424.1847 1438.8608 1449.7262 1453.5014 1458.7772 1461.7694 1467.6373 1474.6026 1480.5295 1485.4932 1492.5121 1527.5007 1552.4988 1557.4430 1565.3148 1585.6573 1616.2262 1630.8370 1653.0087 2836.5301 2843.5131 2861.4778 3010.6797 3015.2433 3021.1001 3050.2343 3072.1679 3076.0059 3080.1403 3084.3652 3110.9191 3111.4673 3136.6455 3143.9540 3154.6593 3161.8343 3169.1054 3576.1249 3708.2811
redmass: 3.7346 4.6614 2.8331 4.5141 5.4777 4.6512 2.3732 3.5776 4.0950 3.7214 3.1489 1.2189 2.3365 1.7995 2.7538 2.6023 4.7836 4.5724 6.8534 2.4381 4.2754 1.3503 3.9683 2.8194 3.1967 2.9886 1.3116 5.2134 3.7682 4.0786 3.2833 6.4759 4.8469 3.3780 6.3010 5.0327 5.9476 3.7320 5.0542 1.9792 1.5216 2.0041 2.4510 2.8964 3.0472 2.7847 4.5828 2.0236 6.0502 3.7704 1.2148 1.2306 1.3523 1.3342 1.3727 3.4664 2.3137 2.5303 1.6973 2.6232 1.7788 1.9586 1.4019 2.5834 1.6299 1.5078 1.7191 1.7652 1.2601 2.0595 1.4886 2.9914 2.0812 1.6136 1.8179 2.6765 1.2764 4.0927 1.3239 2.2354 1.3209 5.0131 5.5582 1.1399 2.5431 1.1504 1.2228 2.4297 3.0863 1.0573 1.0575 1.0521 1.0890 1.0588 3.9871 5.9419 6.0202 2.1986 6.8356 3.6665 6.1700 5.5888 1.2359 1.0580 1.0639 1.0636 1.0594 1.0724 1.0705 1.0890 1.0948 1.0980 1.1001 1.0999 1.0870 1.0870 1.0874 1.0901 1.0939 1.0978 1.1004 1.0454 1.1028
irintensity: 0.8946 3.0208 0.3492 0.2190 2.0220 1.1869 0.7108 6.4207 7.6053 3.1090 0.0376 0.6322 4.4981 1.8383 0.5524 6.4590 2.4115 6.5523 2.8133 10.1239 8.4919 0.5563 8.1128 0.2660 2.2487 11.2672 190.9679 3.9172 3.8679 15.6054 4.8008 1.3666 0.9238 16.4010 2.7883 51.3242 9.2363 0.2603 0.7461 74.5093 71.0086 1.6936 0.0881 6.6820 13.4873 5.7571 2.8891 0.0285 5.7272 10.3127 49.6073 28.2456 10.4197 1.1354 2.6055 16.7984 11.4869 13.1469 16.0922 62.9524 6.3575 20.0486 11.2956 10.9103 7.7280 3.9973 0.9500 7.6861 0.8725 9.7871 1.8706 1.5312 14.5311 7.2343 3.7262 63.1694 1.7772 30.3351 0.9132 5.9714 0.3794 26.2267 27.5999 3.7052 11.9934 5.1012 12.3430 9.7363 25.1188 13.8194 7.5259 34.3548 14.3643 10.1455 189.2306 129.7064 56.8134 330.3028 44.0848 60.4640 131.2509 21.9447 331.1981 72.0189 86.1899 213.8093 40.2881 45.3679 77.7521 5.5950 525.8932 201.6886 57.9541 45.1208 4.1444 16.6589 7.3525 7.5011 18.7288 27.3907 27.3005 73.8754 25.9130
temp: 298.150 k
press: 1.00000 atm
elementType: 8 7 7 7 7 6 6 6 6 6 6 6 6 6 6 6 6 6 6 6 6 6 6 1 1 1 1 1 1 1 1 1 1 1 1 1 1 1 1 1 1 1 1
symmnumber: 1
zpe: 916328.9 jmol-1
zpe.correction: 0.349011 hartree
zpe.thermalcorrener: 0.370097 hartree
zpe.thermalcorrenthalpy: 0.371041 hartree
zpe.thermalcorrgfe: 0.297443 hartree
zpe.sumelectzpe: -990.521663 hartree
zpe.sumelectthermal: -990.500577 hartree
zpe.sumelectthermalent: -990.499632 hartree
zpe.sumelectthermalfe: -990.573231 hartree
dipole: -8.0299 2.6985 1.9369
dipole: 8.6898
quadrupole: -102.7916 -124.1082 -142.5316
quadrupole: 15.7678 0.4750 -4.7055
quadrupole: 20.3522 -0.9644 -19.3878 15.7678 0.4750 -4.7055
hfenergy: -990.8706739 hartree
pointgroup: C01 [X(C18H20N4O1)]
dipole: -3.1766713 0.2664379 1.2354041 debye
polarizability: 314.9866624|-5.4591962|298.5062138|-39.5383724|60.6345491|139.0400959 unknown
InChI: InChI=1S/C18H20N4O/c1-22(2)11-10-20-18(23)14-8-5-7-13-16(19)12-6-3-4-9-15(12)21-17(13)14/h3-9,20H,10-11,19H2,1-2H3
charge 0 multiplicity 1
43 atoms
O  2.946954 -2.014719 -1.571251
N  -0.446428 0.133069 -0.076729
N  2.121242 0.02281 -0.787228
N  5.6445 1.159114 0.116167
N  -4.200601 -1.838335 0.306292
C  -1.832371 -1.907428 -0.32134
C  -0.56808 -1.188775 -0.433883
C  0.596676 -1.899658 -0.941614
C  -2.983208 -1.200674 0.181991
C  -2.848086 0.182749 0.554658
C  -1.543491 0.800242 0.401182
C  3.403305 0.720231 -0.931851
C  4.373943 0.409907 0.238374
C  -1.893768 -3.285769 -0.712204
C  1.984742 -1.300295 -1.122001
C  0.472873 -3.244285 -1.305035
C  -0.764203 -3.942976 -1.19499
C  -3.93114 0.974912 1.06686
C  -1.385831 2.182217 0.767187
C  -3.74638 2.312371 1.413148
C  -2.457082 2.921659 1.260554
C  6.778563 0.485374 0.778703
C  5.529978 2.57209 0.524262
H  3.893322 0.402821 -1.868876
H  3.19895 1.804477 -0.993588
H  3.855711 0.611346 1.211292
H  4.594781 -0.67122 0.199179
H  -2.830533 -3.851942 -0.640305
H  1.249444 0.476346 -0.422582
H  1.375744 -3.737921 -1.680993
H  -0.822576 -4.995362 -1.49105
H  -4.931026 0.542475 1.197599
H  -0.392933 2.625465 0.641957
H  -4.314785 -2.813455 0.048939
H  -5.016596 -1.347189 0.657438
H  -4.583658 2.901154 1.802125
H  -2.319859 3.973312 1.534757
H  6.882434 -0.540204 0.383658
H  6.672656 0.419934 1.892456
H  7.714541 1.032136 0.560415
H  5.297907 2.697178 1.614397
H  4.734887 3.076956 -0.051517
H  6.479184 3.097864 0.314944
