program: Gaussian 09
title: 000128894
version: EM64L-G09RevD.01
frameworkgroup: C1[X(C13H11NO3S)]
method: RPBEPBE
basis: SDD
operation: Freq
keyword: #p
keyword: freq=noraman
keyword: PBEPBE/SDD
title: #p freq=noraman PBEPBE/SDD
converged: YES YES NO NO
title: Mulliken charges:
elementType: S O O O N C C C C C C C C C C C C C H H H H H H H H H H H
charge: 0.329261 -0.298369 -0.238733 -0.256364 -0.449847 0.485195 0.394211 -0.317807 -0.441122 -0.419267 -0.289668 -0.293928 0.296975 -0.235432 0.219734 -0.125543 -0.509571 -0.780477 0.313489 0.221019 0.252665 0.304861 0.303559 0.279915 0.252415 0.271063 0.259313 0.259560 0.212891
chargesum: 0.00000
title: Mulliken charges with hydrogens summed into heavy atoms:
elementType: S O O O N C C C C C C C C C C C C C
charge: 0.329261 -0.298369 -0.238733 -0.256364 -0.146288 0.485195 0.394211 -0.004319 -0.220103 -0.166601 0.015193 -0.293928 0.296975 0.044483 0.219734 0.126872 -0.238508 -0.048713
polarizability: 3.48963942e+02 -4.98552500e+00 1.74643515e+02 -2.81823746e-04 -4.68023016e-02 7.08689225e+01
1716.lowfreq: -9.4562 -0.0022 -0.0018 0.0010 1.6107 2.6404 20.6045 25.8685 53.4634
frequency: 20.4100 25.6769 53.4549 59.3435 65.1998 71.3148 95.2870 137.0951 166.3873 174.5432 212.0169 230.5643 304.4813 345.7255 374.0317 379.3312 414.0094 438.6591 452.7329 503.9397 522.5052 562.0145 595.1605 611.8463 623.8144 640.6778 644.9908 691.6655 697.8379 720.7168 722.7082 747.9761 764.5281 827.8801 830.9366 835.7447 855.0083 858.8132 931.0870 932.3223 963.5769 975.0059 988.6648 992.7710 1006.1440 1039.9165 1057.3742 1090.9264 1119.1935 1155.2392 1195.3341 1211.7426 1217.0992 1240.4588 1267.4930 1300.7880 1341.3655 1368.6999 1388.8506 1415.3985 1448.8039 1453.8301 1470.1330 1487.7025 1504.1591 1523.3114 1591.0264 1617.1535 1624.2774 1628.5247 2995.3789 3097.0349 3098.6684 3116.7948 3162.6250 3181.7484 3199.5413 3204.9595 3212.5786 3236.1707 3535.3422
redmass: 5.4654 5.7039 1.3642 6.1710 5.7832 3.0684 4.6168 5.6925 5.1771 8.2757 5.8509 7.1691 7.6782 6.2331 4.5161 5.4310 3.0943 5.7418 8.6873 4.9100 2.5351 3.1058 3.2266 6.3008 7.1993 8.6309 1.1827 8.4549 6.7838 1.3605 2.5355 7.2506 8.6605 4.8739 1.3446 5.2513 1.3469 1.4720 1.3919 6.4343 1.3237 6.3839 1.3186 1.6723 2.4758 1.6302 1.7027 1.1357 1.2927 2.2765 1.3891 2.0017 3.4228 2.8651 1.9905 1.4085 2.4110 5.8293 1.2221 4.0838 1.0452 6.6989 1.0966 2.3117 2.4930 6.0349 6.5084 6.8983 5.9061 7.0596 1.0362 1.1002 1.0983 1.0912 1.0910 1.0903 1.0952 1.0976 1.0943 1.1004 1.0764
irintensity: 7.7107 1.1527 0.5635 2.5595 6.0306 1.9361 0.0073 5.8092 0.0380 0.0613 0.0370 0.6805 12.1211 5.2953 4.2776 1.8721 0.1927 0.9057 0.5291 4.1158 31.4084 0.3483 0.2236 10.0430 5.3947 2.5985 59.4737 14.0225 11.5997 92.7927 21.3155 8.2968 3.3909 14.8803 26.0716 3.2650 3.8124 96.0787 1.3442 13.1087 0.7194 229.1651 2.3947 12.1736 65.2156 15.0953 130.9056 44.2307 22.6019 300.3080 216.3313 2.8937 125.7226 319.7811 0.6547 46.9604 18.6218 179.9881 55.5857 18.5599 15.5003 135.9564 19.6099 52.4329 584.4206 28.9350 42.3704 117.9535 29.4280 195.5581 14.5455 18.4410 8.6443 22.3154 3.2231 6.3973 8.0542 0.6417 3.8719 0.4203 12.7391
temp: 298.150 k
press: 1.00000 atm
elementType: 16 8 8 8 7 6 6 6 6 6 6 6 6 6 6 6 6 6 1 1 1 1 1 1 1 1 1 1 1
symmnumber: 1
zpe: 555475.5 jmol-1
zpe.correction: 0.211569 hartree
zpe.thermalcorrener: 0.228279 hartree
zpe.thermalcorrenthalpy: 0.229223 hartree
zpe.thermalcorrgfe: 0.164088 hartree
zpe.sumelectzpe: -1179.197509 hartree
zpe.sumelectthermal: -1179.180800 hartree
zpe.sumelectthermalent: -1179.179855 hartree
zpe.sumelectthermalfe: -1179.244990 hartree
dipole: -0.0046 -0.8587 -0.0133
dipole: 0.8588
quadrupole: -78.6873 -109.7507 -116.1396
quadrupole: -30.8088 -0.0429 -0.0087
quadrupole: 22.8386 -8.2248 -14.6137 -30.8088 -0.0429 -0.0087
hfenergy: -1179.4090788 hartree
pointgroup: C01 [X(C13H11N1O3S1)]
dipole: -0.0165424 0.2261645 0.2505003 debye
polarizability: 348.8890676|6.978072|116.0585521|-0.2158056|51.3807396|129.5287593 unknown
InChI: InChI=1S/C13H11NO3S/c1-9(15)14-10-4-6-11(7-5-10)17-13(16)12-3-2-8-18-12/h2-8,14H,1H3
charge 0 multiplicity 1
29 atoms
S  5.188203 1.070675 0.862895
O  1.402694 0.086491 -0.163782
O  2.186835 1.566995 1.510852
O  -4.985331 -1.098852 -1.311634
N  -4.236683 0.386193 0.347246
C  -2.821599 0.298757 0.205897
C  -0.001715 0.231742 0.044369
C  -2.186966 -0.532347 -0.75776
C  -2.023747 1.086402 1.076572
C  -0.782472 -0.557416 -0.828769
C  -0.616848 1.064714 1.009392
C  3.721914 0.357803 0.083265
C  2.401055 0.756489 0.576438
C  4.067037 -0.524765 -0.939868
C  -5.229051 -0.279857 -0.37677
C  5.484248 -0.65427 -1.126811
C  6.223169 0.129187 -0.246564
C  -6.658234 0.054209 0.047037
H  -2.79756 -1.138683 -1.428167
H  -2.503648 1.731762 1.823704
H  -0.276424 -1.190868 -1.5634
H  -0.015796 1.673833 1.684132
H  -4.562402 1.022091 1.078382
H  3.313385 -1.05305 -1.526314
H  5.941127 -1.299659 -1.880242
H  7.304975 0.224383 -0.1662
H  -7.164135 -0.874688 0.362259
H  -7.208095 0.443406 -0.827036
H  -6.725733 0.791022 0.866479
