program: Gaussian 09
title: 000128887
version: EM64L-G09RevD.01
frameworkgroup: C1[X(C10H15N3O5)]
method: RPBEPBE
basis: SDD
operation: Freq
keyword: #p
keyword: freq=noraman
keyword: PBEPBE/SDD
title: #p freq=noraman PBEPBE/SDD
converged: YES YES NO NO
title: Mulliken charges:
elementType: O O O O O N N N C C C C C C C C C C H H H H H H H H H H H H H H H
charge: -0.434635 -0.279574 -0.410053 -0.225441 -0.299074 -0.154820 -0.095817 0.045572 -0.144754 -0.216913 -0.501553 -0.389906 -0.145566 -0.479014 0.273306 -0.458749 -0.350306 0.182500 0.315015 0.284975 0.242600 0.259612 0.228184 0.300606 0.235769 0.231041 0.258557 0.279122 0.228651 0.257754 0.235661 0.346546 0.380702
chargesum: 0.00000
title: Mulliken charges with hydrogens summed into heavy atoms:
elementType: O O O O O N N N C C C C C C C C C C
charge: -0.088089 -0.279574 -0.029351 -0.225441 -0.299074 -0.154820 -0.095817 0.045572 0.170261 0.068062 0.000660 0.138884 0.090202 0.010584 0.273306 0.049024 0.143109 0.182500
polarizability: 1.66590790e+02 1.05575413e+01 1.45646645e+02 -1.75747153e+00 -3.20889958e+00 1.12767689e+02
1716.lowfreq: -21.1087 -10.6744 0.0008 0.0008 0.0009 5.8587 21.1494 33.4690 39.7516
frequency: 18.7609 33.3658 39.6953 59.4336 69.2969 84.2267 104.5722 121.3896 156.0669 170.6910 214.5264 234.9173 267.8759 272.6056 281.1895 282.1862 332.5191 341.9572 376.5010 414.0208 445.9059 485.1604 503.2122 552.4483 566.6583 592.1057 632.9035 685.6307 701.7554 714.7205 747.2660 792.5012 819.5118 848.4481 862.9458 878.6843 894.7789 907.6859 931.1123 958.3755 990.6968 1012.5690 1022.8105 1043.5522 1059.2124 1074.5129 1086.5214 1090.3942 1132.1183 1144.9954 1148.3352 1167.2117 1175.5081 1199.5693 1210.5227 1231.7015 1234.0898 1244.8382 1256.8717 1269.5410 1273.3271 1282.8073 1301.9044 1311.9747 1315.7771 1329.2641 1333.4780 1342.9364 1357.0222 1394.6027 1403.4584 1460.8476 1466.0373 1468.8890 1484.2029 1490.4817 1581.5140 1666.2182 2981.8740 3001.0706 3008.5660 3012.7460 3027.7845 3036.4556 3056.9040 3068.1054 3076.6488 3082.8758 3092.8199 3100.2464 3111.9983 3515.5708 3576.3247
redmass: 6.4671 8.0660 6.7821 7.3118 4.4620 5.2612 4.2084 4.7180 3.3434 3.5759 3.5537 2.9734 3.3166 2.5579 2.3396 2.4014 5.7204 4.2795 9.0432 7.7974 3.2049 4.0251 3.0500 2.9849 2.3711 2.0148 2.5484 3.6910 7.3555 5.2111 5.2100 2.9915 3.6026 2.7603 3.0440 2.6827 2.1005 2.2579 1.4853 2.7577 2.0522 2.1781 2.8970 2.7478 1.9927 2.2099 2.1336 1.9286 2.5011 1.4871 2.2096 1.3911 1.8117 1.3027 2.4426 1.5641 1.8067 1.2649 1.5809 2.0384 2.8153 1.4027 1.3640 1.4105 1.4879 1.3169 1.3756 1.7449 1.6576 1.9056 2.8777 1.0900 1.0997 1.0892 1.0884 1.0850 7.1277 8.8309 1.0862 1.0640 1.0578 1.0645 1.0605 1.0611 1.0846 1.0856 1.1066 1.1003 1.1009 1.1056 1.1061 1.0641 1.0664
irintensity: 3.4616 2.4981 3.7599 2.1923 3.4554 1.0975 2.3815 1.5892 1.3367 4.6903 6.9979 6.7235 11.0844 64.0116 14.0763 73.0925 2.5420 4.4224 14.2368 15.1341 2.0015 3.4467 32.5510 25.5614 4.9394 54.4955 101.6709 12.1625 5.0520 6.0592 11.6551 1.6483 17.0054 9.5135 3.2408 2.8073 1.1342 6.5563 8.3897 10.4976 22.0518 13.2200 67.2650 324.7321 3.8638 22.3415 10.4757 2.1472 54.7319 3.3255 2.6900 4.8512 11.0499 16.1231 102.0418 23.1385 25.4886 23.4839 5.1247 6.2035 56.4243 16.9647 5.2914 3.9225 35.1817 12.7566 11.1205 31.9426 29.1405 77.1218 93.5169 18.1300 28.0901 7.3339 10.7585 11.0808 248.5258 178.6443 32.7172 36.4401 18.2737 22.0169 13.5666 36.4102 10.0730 3.5479 18.2783 10.8824 7.7351 15.9457 25.8252 29.4796 9.0661
temp: 298.150 k
press: 1.00000 atm
elementType: 8 8 8 8 8 7 7 7 6 6 6 6 6 6 6 6 6 6 1 1 1 1 1 1 1 1 1 1 1 1 1 1 1
symmnumber: 1
zpe: 677133.7 jmol-1
zpe.correction: 0.257907 hartree
zpe.thermalcorrener: 0.275599 hartree
zpe.thermalcorrenthalpy: 0.276543 hartree
zpe.thermalcorrgfe: 0.210026 hartree
zpe.sumelectzpe: -928.996451 hartree
zpe.sumelectthermal: -928.978758 hartree
zpe.sumelectthermalent: -928.977814 hartree
zpe.sumelectthermalfe: -929.044331 hartree
dipole: 1.9050 -1.9884 2.6061
dipole: 3.7914
quadrupole: -74.8933 -117.0394 -108.1370
quadrupole: 7.3220 -7.2570 4.5843
quadrupole: 25.1299 -17.0162 -8.1138 7.3220 -7.2570 4.5843
hfenergy: -929.2543576 hartree
pointgroup: C01 [X(C10H15N3O5)]
dipole: 0.8645617 -0.4793042 1.1170484 debye
polarizability: 165.289817|8.1921618|141.2952507|-9.7189553|-12.2507681|118.4200568 unknown
InChI: InChI=1S/C10H15N3O5/c14-6-4-8(10(16)17)12(5-6)9(15)7-2-1-3-13(7)11-18/h6-8,14,16H,1-5H2
charge 0 multiplicity 1
33 atoms
O  3.021421 3.006639 -0.296701
O  -0.65149 -1.582472 -0.167023
O  3.170144 -2.52762 -0.452211
O  2.45695 -1.578687 1.547031
O  -1.606568 2.196897 -1.141724
N  0.779653 0.217533 0.061479
N  -2.712593 0.647434 0.01424
N  -2.72393 1.548842 -0.997985
C  1.851801 -0.526155 -0.632921
C  -1.560553 0.409883 0.939359
C  2.859046 0.589308 -1.025387
C  1.181663 1.599934 0.427266
C  2.691857 1.63896 0.104303
C  -2.227613 -0.425921 2.067475
C  -0.444858 -0.386363 0.22537
C  -3.384146 -1.185205 1.357445
C  -3.916191 -0.172331 0.315783
C  2.483646 -1.568541 0.299325
H  1.449514 -1.064887 -1.505962
H  -1.187561 1.388594 1.283299
H  3.889211 0.2128 -1.136727
H  2.53872 1.047209 -1.978103
H  0.995425 1.80762 1.494365
H  0.640917 2.338931 -0.191853
H  3.283141 1.337755 0.993651
H  -2.623825 0.257991 2.840625
H  -1.509718 -1.113091 2.542445
H  -2.972383 -2.068581 0.843615
H  -4.172001 -1.506346 2.058752
H  -4.290871 -0.645734 -0.605876
H  -4.710986 0.475836 0.731106
H  4.004506 3.110595 -0.34628
H  3.581071 -3.197726 0.15852
