program: Gaussian 09
title: 000128859
version: EM64L-G09RevD.01
frameworkgroup: C1[X(C8H14O3)]
method: RPBEPBE
basis: SDD
operation: Freq
keyword: #pfreq=noraman
keyword: PBEPBE/SDD
title: #p freq=noraman PBEPBE/SDD
converged: YES YES NO NO
title: Mulliken charges:
elementType: O O O C C C C C C C C H H H H H H H H H H H H H H
charge: -0.184115 -0.399444 -0.237328 -0.365012 -0.341186 -0.505292 -0.356263 0.199074 -0.694978 -0.568086 0.207004 0.216127 0.209089 0.182169 0.190290 0.282978 0.229824 0.198024 0.197060 0.217236 0.208922 0.210322 0.245466 0.277742 0.380379
chargesum: 0.00000
title: Mulliken charges with hydrogens summed into heavy atoms:
elementType: O O O C C C C C C C C
charge: -0.184115 -0.019066 -0.237328 0.060204 0.031273 0.007510 0.038820 0.199074 -0.058498 -0.044878 0.207004
polarizability: 1.20090870e+02 -4.87574649e-01 9.21600127e+01 -3.26365956e+00 -2.11969118e+00 7.68858749e+01
1716.lowfreq: -5.1263 0.0007 0.0008 0.0009 4.6532 7.5143 24.4981 35.9842 43.6332
frequency: 24.3889 35.8841 43.6210 60.7853 88.0500 104.3684 119.0442 168.8762 214.1159 229.3288 257.0430 379.9145 400.4019 435.3233 478.7559 504.0833 575.6311 636.5924 692.8525 722.8389 749.7481 813.5583 827.8315 870.1574 899.5093 923.5143 957.9040 1007.9200 1033.9237 1065.3965 1077.1580 1098.2762 1103.7363 1124.7401 1179.3711 1196.9645 1236.2290 1245.2659 1260.2512 1286.3068 1291.0638 1309.2694 1326.8350 1352.6049 1362.4937 1389.3851 1430.5954 1438.7577 1464.6403 1469.3210 1477.1253 1479.0956 1487.9946 1634.9431 1654.0224 2948.4287 2953.0569 2969.3722 2972.4939 2991.1929 2993.6462 3001.4257 3021.7392 3023.5079 3054.3982 3069.0892 3072.2681 3130.1135 3508.2775
redmass: 6.0855 2.9953 2.3795 4.7871 3.6197 2.4455 1.9285 3.4719 3.5988 1.1386 5.4316 3.4017 2.5744 3.1161 3.0459 2.7258 3.4744 1.4895 2.5329 1.1554 1.3058 2.0984 2.5054 2.2719 1.7861 2.3962 1.3381 3.1396 2.2908 2.5872 2.2767 1.4614 2.4082 2.6558 1.3807 1.4946 1.3513 1.3639 1.2806 1.0816 1.1116 1.4472 1.9255 1.6124 1.7464 1.2182 1.0942 1.0966 1.0706 1.0722 1.0425 1.0701 1.0857 8.5335 8.3810 1.0638 1.0591 1.0585 1.0371 1.0623 1.0956 1.0938 1.0634 1.1019 1.1030 1.1008 1.0992 1.0999 1.0639
irintensity: 1.6177 0.9761 0.8409 4.3239 3.0007 0.8316 0.0504 2.0726 3.3948 0.0889 0.8310 1.7298 8.2397 2.0604 7.3577 30.7649 42.2466 128.4847 32.5090 12.6388 1.0695 1.6689 5.0927 3.1995 4.9436 8.0577 2.8451 27.8277 135.2998 48.3374 22.4119 10.7489 161.6793 76.9478 22.4893 2.1167 16.8043 22.9865 8.1990 0.1882 0.7283 62.9653 67.2746 3.3780 19.7265 9.9869 29.6180 28.9485 0.1465 0.7994 12.6478 5.6278 19.9157 298.5643 63.2947 9.7505 16.6031 52.0666 32.3108 33.4376 4.1970 0.8790 3.5858 15.0281 32.9909 102.6243 52.3343 1.9524 32.2247
temp: 298.150 k
press: 1.00000 atm
elementType: 8 8 8 6 6 6 6 6 6 6 6 1 1 1 1 1 1 1 1 1 1 1 1 1 1
symmnumber: 1
zpe: 546734.2 jmol-1
zpe.correction: 0.208240 hartree
zpe.thermalcorrener: 0.221559 hartree
zpe.thermalcorrenthalpy: 0.222503 hartree
zpe.thermalcorrgfe: 0.165607 hartree
zpe.sumelectzpe: -538.042774 hartree
zpe.sumelectthermal: -538.029455 hartree
zpe.sumelectthermalent: -538.028511 hartree
zpe.sumelectthermalfe: -538.085407 hartree
dipole: 0.3918 -1.2719 1.4089
dipole: 1.9381
quadrupole: -59.7980 -76.8588 -63.3931
quadrupole: -4.4945 -0.1636 5.2419
quadrupole: 6.8853 -10.1755 3.2902 -4.4945 -0.1636 5.2419
hfenergy: -538.2510138 hartree
pointgroup: C01 [X(C8H14O3)]
dipole: 0.1252179 0.688969 0.3017817 debye
dipolederiv: -0.6328312 -0.0172584 -0.0091262 -0.1492137 -0.6007904 -0.4023444 -0.0150993 -0.2754173 -0.5766815 -1.2331116 0.2713343 -0.0220007 0.4498094 -0.5262083 0.0227382 -0.1028675 -0.0015536 -0.2382559 -0.673954 0.1519186 0.0562828 0.166992 -0.3839626 -0.0085078 0.131643 -0.179934 -0.9288845 0.0073913 -0.0153133 0.0302111 0.0021404 0.0895008 -0.0187766 0.0443104 -0.0426396 0.1370322 -0.0281362 -0.0272531 0.0405807 -0.069734 0.1002482 -0.0451933 0.0202208 -0.0413811 0.1542352 -0.3673205 0.077354 0.119995 0.1864938 -0.0425555 -0.2057397 0.1808067 -0.1559124 -0.058845 0.0395222 -0.0035842 0.0313815 0.0399269 0.1167612 -0.0293172 0.0537434 -0.0262089 0.1486771 1.3457801 0.0973857 0.1268588 0.2540059 0.6371868 0.6165648 -0.0334331 0.4555203 0.4884302 -0.0700166 0.0226658 0.0522602 -0.0114523 0.0647932 -0.017344 0.0383892 -0.0226427 0.0733793 -0.6753042 -0.1490994 -0.3688527 -0.1084929 -0.0276918 -0.000925 -0.3650693 -0.0435746 -0.3720248 1.4488622 -0.5332178 0.0372132 -0.7719792 0.4216307 -0.1178882 0.2275907 0.1354876 1.3148343 0.0455589 -0.0073684 -0.0346346 -0.0220962 0.0625965 -0.0284732 -0.0428271 -0.0398209 -0.1241813 0.0383936 0.0275237 -0.006872 0.023437 -0.116453 0.072369 -0.0189471 0.084033 0.032326 0.0283094 0.0318112 -0.0087239 0.035117 -0.1616507 0.0812827 -0.0088432 0.1046522 0.0229548 0.028515 -0.0221721 -0.0500644 -0.0098823 0.0480897 -0.0441908 -0.040793 -0.0644513 -0.167886 0.1147706 -0.0004807 -0.0092167 -0.0590086 0.1029036 0.0075262 -0.0261439 -0.0289322 0.00269 0.0547149 0.0225986 0.0150286 -0.0400835 -0.0796749 0.0733459 -0.0021966 0.0881765 0.0772253 0.0173126 0.0719821 -0.0169572 0.0337529 -0.1544562 0.0785886 -0.0114857 0.1000044 0.0341655 0.0272245 -0.0084885 -0.0077701 -0.0156346 0.0554702 -0.0451639 -0.038128 -0.077314 -0.186444 -0.1665091 -0.1108136 0.0111672 -0.1441765 0.0011556 -0.0122045 -0.0024519 -0.0206931 0.0910832 0.0704277 0.0343297 0.0013583 0.0961751 -0.1298131 0.0848945 -0.022391 0.111773 0.0294446 0.0721249 -0.0019393 -0.0686283 0.0232501 0.07578 -0.0505188 -0.0027808 -0.0555877 -0.1732246 0.1358305 0.067007 0.005482 0.0448627 -0.0291094 0.0136822 0.0013507 -0.0141961 0.0988255 -0.0078221 -0.0024701 0.0551509 0.014116 0.0949208 -0.0387708 0.049725 -0.0123597 0.0320664 0.380267 0.023548 0.0198765 0.0316747 0.3813286 0.0143661 -0.0143224 0.0229723 0.0890581 unknown
polarizability: 120.2794371|-1.1458382|79.4535865|1.0971772|6.3012225|89.4037341 unknown
InChI: InChI=1S/C8H14O3/c1-2-3-4-5-7(9)6-8(10)11/h10H,2-6H2,1H3
charge 0 multiplicity 1
25 atoms
O  0.870637 -0.87648 -1.818457
O  3.98568 -0.126986 0.587682
O  2.172369 0.765351 1.732569
C  -1.600467 -0.240359 -0.47386
C  -2.843411 0.391431 0.190891
C  -0.345145 0.637784 -0.320364
C  -4.104578 -0.494837 0.073755
C  0.889038 0.099154 -1.029216
C  -5.350577 0.143203 0.724919
C  2.227354 0.83752 -0.74372
C  2.747327 0.51868 0.647599
H  -1.795491 -0.419757 -1.548417
H  -1.404013 -1.236014 -0.030241
H  -3.049839 1.379996 -0.271444
H  -2.634018 0.587383 1.263365
H  -0.084519 0.799991 0.746004
H  -0.534802 1.657022 -0.725171
H  -3.902287 -1.478745 0.543557
H  -4.308376 -0.698365 -0.997242
H  -6.236801 -0.510706 0.629608
H  -5.593515 1.112703 0.250131
H  -5.183175 0.330694 1.802453
H  2.046312 1.927474 -0.789207
H  2.96999 0.544107 -1.498983
H  4.291407 -0.342846 1.511191
