program: Gaussian 09
title: 000128871
version: EM64L-G09RevD.01
frameworkgroup: C1[X(C12H14N2O5)]
method: RPBEPBE
basis: SDD
operation: Freq
keyword: #p
keyword: freq=noraman
keyword: PBEPBE/SDD
title: #p freq=noraman PBEPBE/SDD
converged: YES YES NO NO
title: Mulliken charges:
elementType: O O O O O N N C C C C C C C C C C C C H H H H H H H H H H H H H H
charge: -0.284728 -0.419634 -0.219236 -0.461537 -0.265357 -0.384135 -0.674392 -0.110948 -0.571543 0.204248 0.211707 0.156251 0.142729 -0.342322 0.101483 0.282615 -0.265942 -0.320370 -0.778937 0.318563 0.281711 0.226158 0.296554 0.236246 0.232593 0.254023 0.307771 0.385719 0.255034 0.254902 0.209595 0.385434 0.355746
chargesum: 0.00000
title: Mulliken charges with hydrogens summed into heavy atoms:
elementType: O O O O O N N C C C C C C C C C C C C
charge: -0.284728 -0.034200 -0.219236 -0.105791 -0.265357 -0.087582 0.019098 0.207616 -0.063674 0.204248 0.211707 0.156251 0.142729 -0.106076 0.101483 0.282615 -0.033349 -0.066347 -0.059407
polarizability: 2.13620243e+02 1.54602016e+00 1.64015778e+02 7.99333571e+00 -2.33775245e+01 1.21876893e+02
1716.lowfreq: -0.0008 -0.0004 -0.0004 4.0738 5.1648 8.9952 21.2747 24.2474 31.8155
frequency: 21.2374 24.2258 31.7698 41.6590 52.5384 69.8279 80.4022 95.1879 103.0478 146.9814 162.4329 187.0041 206.7577 224.3843 278.2475 285.9156 308.9417 351.9039 358.2438 401.3826 413.7202 452.8277 481.7544 487.1632 519.6910 539.0236 553.2969 564.9239 578.9635 586.4192 604.6003 609.7521 617.5343 639.2667 687.1999 716.7659 734.8145 774.9226 811.6048 830.3785 857.0045 870.4362 900.9445 911.3483 952.0119 957.3244 985.8866 1005.7873 1039.0834 1042.0513 1068.4921 1075.7053 1115.5913 1144.9000 1162.7613 1191.9480 1213.1392 1234.1615 1259.9745 1264.5109 1271.3050 1288.7752 1311.3057 1338.2931 1338.4758 1386.6201 1403.5241 1436.1672 1449.4272 1449.9960 1464.8308 1468.2128 1483.9346 1533.6367 1572.6065 1591.0248 1628.0924 1629.7432 1668.6428 2992.9806 2997.5094 3017.2032 3052.9006 3098.9010 3102.5503 3145.3490 3160.1651 3177.0294 3352.1565 3513.4700 3519.2815 3555.1477 3614.3130
redmass: 5.1693 3.8822 3.3477 5.6453 2.1098 3.0679 5.5439 2.7755 2.1057 3.1842 5.4160 6.1972 4.0226 2.6948 4.7720 4.5530 3.8702 3.9574 4.0292 4.8337 5.7709 3.6758 5.8113 3.2989 1.5308 3.7575 2.2483 1.7140 1.9505 2.6198 2.0239 3.5306 3.2474 5.0522 3.9157 6.5009 2.2608 1.7217 1.1932 4.6536 4.4776 2.4939 1.9771 2.3951 4.0389 1.3695 1.6493 2.5800 2.3789 1.7603 1.9952 2.1034 1.7087 2.3894 1.3562 1.4370 1.6440 1.4079 2.3791 1.8618 1.8419 1.7569 2.1437 2.2077 1.6264 1.2260 4.5128 1.2411 2.5648 1.1071 1.3900 1.6115 1.7866 4.0986 5.3064 1.8123 6.2616 6.4781 9.0301 1.0603 1.0361 1.0811 1.0995 1.1000 1.0987 1.0857 1.0919 1.0993 1.0574 1.0660 1.0643 1.0777 1.0928
irintensity: 0.3654 0.5910 2.5960 1.1120 11.1596 3.3512 1.3342 41.7693 78.1944 51.1368 1.6347 2.8326 1.9052 13.5613 14.2290 8.6550 6.9017 6.9078 1.1628 6.1185 6.0294 15.1323 5.7770 38.6188 51.2793 13.4859 37.0863 40.0810 182.1906 14.3630 72.1155 26.6067 19.4904 29.4862 22.4189 10.1529 26.1898 82.6783 95.3497 7.9556 20.9083 7.0911 24.0754 24.5592 12.1872 0.8685 24.5027 31.2218 211.3349 37.6540 21.9678 21.8163 182.0580 2.1987 23.9818 2.3157 6.1868 17.9348 193.2236 19.3870 75.9914 120.8115 1.5417 55.5028 63.3081 67.1774 48.3338 64.3122 59.4302 30.4711 55.2912 6.6224 129.7597 308.2304 2.7921 105.5803 19.5650 266.0338 238.8657 14.2505 10.7168 25.5467 6.9777 18.4163 10.0065 1.4684 12.3860 12.4225 107.9181 15.2145 26.0813 13.6061 72.9440
temp: 298.150 k
press: 1.00000 atm
elementType: 8 8 8 8 8 7 7 6 6 6 6 6 6 6 6 6 6 6 6 1 1 1 1 1 1 1 1 1 1 1 1 1 1
symmnumber: 1
zpe: 657368.0 jmol-1
zpe.correction: 0.250378 hartree
zpe.thermalcorrener: 0.269906 hartree
zpe.thermalcorrenthalpy: 0.270850 hartree
zpe.thermalcorrgfe: 0.199261 hartree
zpe.sumelectzpe: -949.923209 hartree
zpe.sumelectthermal: -949.903682 hartree
zpe.sumelectthermalent: -949.902738 hartree
zpe.sumelectthermalfe: -949.974326 hartree
dipole: 3.6228 -2.3948 1.7766
dipole: 4.6921
quadrupole: -118.7504 -100.2201 -108.2190
quadrupole: 7.3212 -12.4363 3.6458
quadrupole: -9.6872 8.8431 0.8441 7.3212 -12.4363 3.6458
hfenergy: -950.1735875 hartree
pointgroup: C01 [X(C12H14N2O5)]
dipole: 1.4639486 0.9465336 -0.607209 debye
polarizability: 214.1702973|-0.6714995|165.0923068|-3.6962969|-22.3785053|120.2503094 unknown
InChI: InChI=1S/C12H14N2O5/c1-6(15)14-8(12(18)19)5-10(17)7-3-2-4-9(16)11(7)13/h2-4,8,14,16,18H,5,13H2,1H3
charge 0 multiplicity 1
33 atoms
O  -0.024599 -1.021005 1.154008
O  -3.051105 2.375138 1.299603
O  -4.173724 1.686032 -0.615158
O  5.135159 -1.290673 0.499362
O  -3.533115 -2.048575 0.606634
N  -2.483381 -0.569097 -0.850436
N  2.479239 -1.842573 1.156501
C  -2.19166 0.407639 0.193608
C  -0.772416 1.009229 0.05151
C  0.319104 0.012297 0.477836
C  1.72594 0.28482 0.131438
C  2.753957 -0.66639 0.492252
C  -3.249814 1.519377 0.206212
C  2.107832 1.466091 -0.58027
C  4.116274 -0.360983 0.151886
C  -3.174931 -1.745365 -0.568544
C  3.438644 1.713547 -0.940225
C  4.452421 0.78839 -0.564865
C  -3.459457 -2.637782 -1.771666
H  -2.256627 -0.138683 1.15493
H  -0.69484 1.904718 0.698099
H  -0.60779 1.349413 -0.988119
H  -2.336487 -0.300333 -1.824477
H  1.343762 2.201362 -0.849326
H  3.705879 2.618925 -1.492911
H  5.504529 0.961631 -0.811721
H  3.182358 -2.579712 1.178952
H  1.493819 -2.011643 1.405947
H  -3.04825 -3.642752 -1.576514
H  -4.55151 -2.745835 -1.889238
H  -3.034596 -2.255331 -2.715952
H  -3.764038 3.069341 1.311341
H  5.144821 -1.441418 1.480603
