program: Gaussian 09
title: 000128843
version: EM64L-G09RevD.01
frameworkgroup: C1[X(C5H6O5)]
method: RPBEPBE
basis: SDD
operation: Freq
keyword: #p
keyword: freq=noraman
keyword: PBEPBE/SDD
title: #p freq=noraman PBEPBE/SDD
converged: YES YES NO NO
title: Mulliken charges:
elementType: O O O O O C C C C C H H H H H H
charge: -0.255639 -0.221354 -0.122169 -0.369237 -0.202908 -0.575773 0.269034 0.149905 0.136557 -0.496701 0.284027 0.281624 0.251433 0.243484 0.235630 0.392087
chargesum: 0.00000
title: Mulliken charges with hydrogens summed into heavy atoms:
elementType: O O O O O C C C C C
charge: -0.255639 -0.221354 -0.122169 0.022850 -0.202908 -0.010122 0.269034 0.149905 0.136557 0.233846
polarizability: 8.51278446e+01 -2.96429305e+00 6.62059281e+01 -1.12050129e+00 1.93957658e+00 5.21021052e+01
1716.lowfreq: -2.7048 -0.0007 -0.0006 0.0007 3.5324 7.4454 22.4603 31.9280 49.8072
frequency: 22.4087 31.9131 49.7967 86.7592 102.1404 185.0539 222.5935 254.9099 331.0301 355.0505 381.0309 486.2563 557.3816 610.3864 617.1853 674.9220 680.1535 788.7519 838.1480 922.9654 967.0022 1008.9498 1095.0914 1114.1069 1122.2586 1152.4520 1233.0198 1292.2732 1325.1323 1406.6587 1425.0635 1453.9750 1463.0780 1624.9797 1645.8846 1663.2919 3008.7398 3021.8279 3084.1173 3112.8431 3154.9660 3509.1436
redmass: 4.4061 8.9524 7.8567 2.0447 1.5374 6.3390 6.6741 3.0970 8.2222 2.9596 3.3486 10.5923 6.7566 1.4113 4.2535 2.9729 4.8883 4.8329 6.3349 3.4175 5.8344 3.9051 2.1780 1.2731 1.5999 1.4300 2.1262 1.8580 2.5504 1.1100 1.1912 1.0492 1.0505 10.5938 9.7647 10.1650 1.0294 1.0611 1.0985 1.1049 1.1050 1.0644
irintensity: 0.9807 2.3951 4.3919 1.0193 0.0719 6.2871 4.7435 19.4443 1.1556 1.4596 3.6882 4.1787 62.6478 112.5958 54.6169 53.2802 4.7337 16.2651 1.9304 30.1881 124.6187 113.4233 51.0285 1.7030 95.8749 5.8904 154.3464 130.7042 9.6420 40.6619 27.6020 15.0035 10.7604 177.4267 150.1908 152.5018 26.2635 5.8317 0.2460 21.8507 14.1889 44.6407
temp: 298.150 k
press: 1.00000 atm
elementType: 8 8 8 8 8 6 6 6 6 6 1 1 1 1 1 1
symmnumber: 1
zpe: 287604.3 jmol-1
zpe.correction: 0.109543 hartree
zpe.thermalcorrener: 0.120533 hartree
zpe.thermalcorrenthalpy: 0.121477 hartree
zpe.thermalcorrgfe: 0.070092 hartree
zpe.sumelectzpe: -569.467600 hartree
zpe.sumelectthermal: -569.456610 hartree
zpe.sumelectthermalent: -569.455665 hartree
zpe.sumelectthermalfe: -569.507051 hartree
dipole: 0.6382 -0.2074 -2.1252
dipole: 2.2287
quadrupole: -39.6720 -63.0064 -60.8146
quadrupole: -0.8241 5.2592 -1.3598
quadrupole: 14.8257 -8.5087 -6.3170 -0.8241 5.2592 -1.3598
hfenergy: -569.5771429 hartree
pointgroup: C01 [X(C5H6O5)]
dipole: 0.2059485 0.6326504 0.5711067 debye
dipolederiv: -1.0160591 -0.0142107 0.3887689 -0.0386651 -0.3279342 -0.1345628 0.5269331 -0.123267 -0.8692634 -0.6059895 -0.0974093 -0.2071453 -0.0671937 -0.3758031 -0.2983188 0.1183041 -0.1495243 -0.8489755 -0.4887373 -0.0913019 0.0024405 0.0643764 -0.6132255 0.1820732 -0.0804467 0.1564565 -0.3225047 -0.7876963 0.4721997 -0.3187129 0.3808791 -0.6042583 0.1849974 -0.2864583 0.2097626 -0.5544973 -0.6549049 -0.1983715 0.0375592 0.0965625 -0.7507314 0.2561775 -0.1228237 0.195766 -0.4190434 -0.5235569 0.0716472 -0.1370629 0.2329778 -0.2357357 0.1715138 -0.2149521 0.1367213 -0.0854349 1.2954204 0.1134261 -0.1011304 0.1417831 0.3159107 0.4866982 -0.5399576 0.3398281 1.3817576 0.9132238 -0.0803558 0.1586548 -0.3853121 0.7551586 -0.3198087 0.315775 -0.2751945 0.3694431 0.929367 -0.1501159 0.2144832 -0.2748584 1.0423897 -0.4777549 0.3144333 -0.4557489 0.5353604 0.5777351 0.0247662 -0.1502616 0.0776525 0.2650853 -0.0580418 -0.0859625 -0.0314578 0.2706853 0.03603 0.0041644 0.031719 -0.0383663 0.1412054 -0.0122592 0.0562358 0.0175646 0.03906 0.1060471 0.0079252 -0.0211456 -0.0410996 0.0696554 -0.0641049 -0.0131604 -0.0694421 0.0817442 0.0092354 0.0345714 0.0352308 -0.046303 -0.0994551 0.0202911 -0.0063007 -0.0295268 0.1047869 -0.0491735 0.0186371 -0.0100971 0.0195025 0.0514757 0.0799768 -0.1134975 0.0789807 -0.0055435 0.0432173 -0.0000959 0.0553258 0.0127977 0.098416 -0.0629654 0.1033026 -0.0503429 -0.063559 0.2158415 -0.1154763 0.0213735 -0.1347336 0.2678467 0.0460884 0.0285756 0.0494246 0.3859842 unknown
polarizability: 85.1288574|3.5100595|61.5410072|1.0070773|-6.6687929|56.7660133 unknown
InChI: InChI=1S/C5H6O5/c1-10-4(7)2-3(6)5(8)9/h8H,2H2,1H3
charge 0 multiplicity 1
16 atoms
O  -2.30772 0.547455 0.464019
O  -2.09206 -0.275364 -1.70807
O  0.378389 -1.308656 0.540307
O  3.027687 -0.650008 0.784238
O  2.61447 1.346575 -0.34328
C  -0.182814 0.814426 -0.586541
C  -1.606268 0.300274 -0.71184
C  0.738478 -0.206339 0.082301
C  2.21553 0.262782 0.139768
C  -3.691587 0.011695 0.511819
H  0.220273 1.055293 -1.586056
H  -0.15397 1.748265 0.004352
H  -3.671386 -1.085547 0.406495
H  -4.296839 0.446928 -0.300783
H  -4.073005 0.309728 1.497832
H  3.967822 -0.320007 0.801338
