program: Gaussian 09
title: 000128881
version: EM64L-G09RevD.01
frameworkgroup: C1[X(C16H24N4O4)]
method: RPBEPBE
basis: SDD
operation: Freq
keyword: #p
keyword: freq=noraman
keyword: PBEPBE/SDD
title: #p freq=noraman PBEPBE/SDD
converged: YES YES NO NO
title: Mulliken charges:
elementType: O O O O N N N N C C C C C C C C C C C C C C C C H H H H H H H H H H H H H H H H H H H H H H H H
charge: -0.224409 -0.418054 -0.235914 -0.437723 -0.589861 -0.116285 -0.659100 -0.634319 -0.114819 -0.604878 -0.198389 -0.397595 -0.622836 0.216983 -0.390594 0.486912 0.137675 -0.465233 -0.382956 -0.391009 -0.350525 -0.393024 0.279503 0.212880 0.295228 0.284274 0.267202 0.218378 0.201231 0.247793 0.226763 0.231794 0.198079 0.200900 0.263783 0.295665 0.197306 0.203168 0.258218 0.251860 0.247531 0.215412 0.377743 0.350424 0.310961 0.337946 0.293713 0.318196
chargesum: 0.00000
title: Mulliken charges with hydrogens summed into heavy atoms:
elementType: O O O O N N N N C C C C C C C C C C C C C C C C
charge: -0.224409 -0.040311 -0.235914 -0.087299 -0.030413 -0.116285 -0.010194 -0.022410 0.180410 -0.053402 0.019989 0.051429 -0.164279 0.216983 0.008385 0.486912 0.137675 -0.064758 -0.124739 -0.139148 -0.102994 -0.177612 0.279503 0.212880
polarizability: 2.82976136e+02 -1.75709143e+01 1.83865020e+02 -2.93673886e+00 -1.02770965e+01 1.89415645e+02
1716.lowfreq: -10.2641 -6.3080 -4.4359 -0.0002 0.0003 0.0006 7.9412 12.7076 16.2036
frequency: 7.8611 12.5685 16.1475 25.5621 29.4487 38.4805 42.6297 47.5300 60.1859 81.9524 94.6211 125.8413 143.5873 151.1222 174.5811 185.7371 199.1667 240.3137 251.1752 262.3466 273.8540 302.0390 313.3290 324.6079 326.5161 357.6350 358.4534 364.2979 400.3518 403.2787 410.9150 428.2327 440.3515 453.5539 468.0915 486.4337 500.2402 543.7941 548.8558 562.6422 575.6442 588.1751 597.9390 633.0198 635.4531 653.4516 675.8698 701.8653 715.1884 753.2117 759.3544 785.2939 808.4840 822.7874 835.3418 843.3290 868.2357 880.1134 895.3214 934.5860 965.2918 966.4743 973.1329 979.6258 1005.4753 1010.2150 1027.7734 1032.7847 1036.7789 1058.0480 1072.0320 1077.9781 1097.5665 1109.1483 1125.4985 1143.1553 1151.7767 1164.2454 1179.7324 1180.2085 1184.7350 1204.8718 1216.8557 1222.5732 1237.5916 1245.0710 1277.1358 1283.0030 1288.3685 1301.6068 1317.0294 1321.2286 1332.9272 1343.0617 1353.1397 1357.7531 1387.7140 1392.4636 1412.0779 1424.8436 1428.1570 1451.4672 1457.2541 1462.2903 1466.4736 1505.1233 1596.1946 1598.1718 1600.7450 1616.8401 1626.7152 1640.7961 1657.5979 1670.4069 2873.8240 2917.6877 2968.8773 2970.8306 2975.5584 2982.9139 3003.5754 3021.4633 3023.1640 3039.0016 3048.9923 3064.0580 3110.3441 3124.4475 3147.5585 3168.1365 3445.5562 3512.1546 3526.6266 3552.1196 3577.7606 3580.6949 3675.2555 3697.2928
redmass: 5.8777 5.3097 4.4967 4.5253 4.3687 4.3517 9.4294 4.8012 7.1044 5.1525 5.4589 4.5928 3.4050 5.2193 2.7420 4.7179 3.3036 3.1433 5.6400 2.1743 1.1574 3.0329 3.9882 2.4522 4.4471 1.1217 1.2334 3.9492 1.2673 3.0006 2.9369 1.2203 2.2188 2.6608 3.6874 2.6519 3.1404 2.8065 1.7441 1.9310 3.0747 3.0572 1.3927 1.6254 6.1624 2.3561 5.5910 3.6130 3.5816 1.9581 3.2671 2.3778 1.4965 3.2557 2.6299 1.8477 2.2075 2.9100 1.9860 1.3767 3.1134 1.3975 2.4473 2.8350 2.8309 3.0521 1.9687 1.6074 3.0108 2.0259 2.2878 2.3251 1.7983 1.9797 1.7464 1.3898 1.3212 1.1898 1.9641 1.1741 1.5406 1.3126 2.2047 1.2789 1.4561 2.9332 1.2711 1.4231 1.1711 1.1905 1.3715 1.3910 1.4711 1.4099 1.7699 1.4175 1.6017 5.5453 4.3044 1.1994 2.2166 1.0911 1.0870 1.1040 1.1034 2.7503 2.8998 3.4547 1.2344 1.2881 6.3940 1.7944 7.5727 3.5449 1.0548 1.1012 1.0626 1.0668 1.0616 1.0748 1.0596 1.0976 1.0884 1.0936 1.1045 1.1024 1.0890 1.0903 1.0953 1.0951 1.0447 1.0640 1.0450 1.0454 1.0974 1.0659 1.1020 1.1029
irintensity: 0.6107 0.8610 0.8351 0.6819 1.2991 2.6369 1.7060 1.1091 0.1108 5.3946 2.2716 2.5404 3.0707 3.1158 1.5484 4.3571 1.7232 7.1490 0.9007 3.4371 63.9998 3.4148 8.3373 4.5512 5.6567 106.4725 127.8415 4.2505 178.3554 13.5738 1.4041 127.1467 30.5676 14.5228 5.6362 14.6785 26.2077 61.8289 162.0540 109.3375 2.7995 6.4715 97.6016 254.6690 9.5805 58.0205 60.6857 32.0898 0.7137 16.2191 13.5091 5.7974 23.3165 7.3059 17.5864 26.5295 10.1087 8.9364 2.0592 0.2483 21.1244 0.7052 16.1560 0.2856 4.8691 95.6556 56.9556 1.5073 131.9808 23.9977 24.5537 43.6461 11.7908 32.9896 3.7830 233.6258 10.8472 4.6078 3.1382 10.0049 12.7403 30.1613 0.2847 7.4174 14.6255 20.8415 7.2032 54.9248 3.9893 5.8648 32.6646 30.5813 1.7657 39.1889 21.0526 14.0206 25.7774 13.0892 124.4923 26.1348 19.2685 4.1731 27.3728 15.2042 8.0387 109.4923 63.5665 85.0248 123.2500 95.9252 30.8089 38.5890 190.3039 632.8571 69.2236 48.2259 11.9077 19.1223 47.7580 59.5786 32.9501 10.3523 14.9404 11.7793 48.2474 7.0563 23.7829 6.7944 8.5106 6.1158 8.1155 23.7768 22.2431 19.5164 6.9416 36.6188 20.0516 20.4893
temp: 298.150 k
press: 1.00000 atm
elementType: 8 8 8 8 7 7 7 7 6 6 6 6 6 6 6 6 6 6 6 6 6 6 6 6 1 1 1 1 1 1 1 1 1 1 1 1 1 1 1 1 1 1 1 1 1 1 1 1
symmnumber: 1
zpe: 1026803.4 jmol-1
zpe.correction: 0.391089 hartree
zpe.thermalcorrener: 0.417511 hartree
zpe.thermalcorrenthalpy: 0.418455 hartree
zpe.thermalcorrgfe: 0.328498 hartree
zpe.sumelectzpe: -1142.167594 hartree
zpe.sumelectthermal: -1142.141172 hartree
zpe.sumelectthermalent: -1142.140228 hartree
zpe.sumelectthermalfe: -1142.230185 hartree
dipole: -5.3059 -3.0262 2.5843
dipole: 6.6325
quadrupole: -101.0396 -133.0368 -148.3609
quadrupole: 13.5008 11.6837 0.7854
quadrupole: 26.4395 -5.5577 -20.8818 13.5008 11.6837 0.7854
hfenergy: -1142.5586828 hartree
pointgroup: C01 [X(C16H24N4O4)]
dipole: 2.0814822 -0.9397579 -1.2622649 debye
polarizability: 282.0649692|20.3316204|181.2694013|-1.9420345|8.1696545|192.9224304 unknown
InChI: InChI=1S/C16H24N4O4/c17-13(2-1-7-20-16(18)19)14(22)9-11(15(23)24)8-10-3-5-12(21)6-4-10/h3-6,11,13,21,23H,1-2,7-9,17-19H2
charge 0 multiplicity 1
48 atoms
O  -0.013378 1.183206 2.144009
O  -2.488615 3.351277 -1.164026
O  -2.377066 1.539675 -2.607288
O  -6.517526 -2.543634 0.862437
N  2.397666 2.454615 2.64359
N  5.284927 -0.543177 -0.425829
N  6.36322 -2.55454 -1.260985
N  7.599488 -0.605968 -0.827599
C  -1.426443 1.356878 -0.3144
C  0.006065 1.93936 -0.179988
C  2.160816 1.879252 1.307842
C  2.945898 0.541719 1.054183
C  -1.421974 -0.189039 -0.47968
C  0.653433 1.622972 1.166721
C  2.873237 -0.037413 -0.375123
C  -2.769011 -0.823019 -0.162501
C  -2.134816 2.028859 -1.481242
C  3.94167 -1.132179 -0.597777
C  -3.174769 -0.991261 1.189625
C  -3.654134 -1.239684 -1.186183
C  -4.420184 -1.562837 1.514915
C  -4.907331 -1.815243 -0.877108
C  -5.286575 -1.975794 0.476345
C  6.33876 -1.223349 -0.813877
H  -1.968811 1.620715 0.612752
H  -0.021193 3.046957 -0.253865
H  0.66497 1.593696 -0.999461
H  2.47261 2.604341 0.529034
H  2.597366 -0.206969 1.794636
H  4.014139 0.746399 1.262521
H  -0.658054 -0.594699 0.20834
H  -1.114934 -0.431918 -1.513535
H  3.054068 0.768312 -1.115249
H  1.872658 -0.468107 -0.581677
H  3.386679 2.485378 2.908826
H  1.803666 2.023879 3.362016
H  3.761133 -1.951316 0.138976
H  3.800163 -1.573499 -1.613871
H  -2.500971 -0.670937 1.994242
H  -3.365494 -1.100354 -2.233892
H  -4.735804 -1.69818 2.553722
H  -5.580832 -2.133265 -1.684296
H  -2.936852 3.768073 -1.949373
H  -7.049942 -2.792936 0.066753
H  7.115018 -2.885243 -1.861518
H  5.520017 -3.116981 -1.195495
H  8.428778 -1.153286 -0.601517
H  7.595764 0.377765 -0.563131
