program: Gaussian 09
title: 000128846
version: EM64L-G09RevD.01
frameworkgroup: C1[X(C18H30O2)]
method: RPBEPBE
basis: SDD
operation: Freq
keyword: #pfreq=noraman
keyword: PBEPBE/SDD
title: #p freq=noraman PBEPBE/SDD
converged: YES YES NO NO
title: Mulliken charges:
elementType: O O C C C C C C C C C C C C C C C C C C H H H H H H H H H H H H H H H H H H H H H H H H H H H H H H
charge: -0.423019 -0.237884 -0.366502 -0.366741 -0.362224 -0.390739 -0.381790 -0.481306 -0.496372 -0.164638 -0.346416 -0.359434 -0.347710 0.201404 -0.487652 -0.171081 -0.694021 -0.546882 -0.009934 -0.027520 0.192758 0.182977 0.217360 0.186986 0.185862 0.213582 0.193656 0.203828 0.223808 0.203778 0.203754 0.205361 0.243824 0.247842 0.220197 0.179062 0.217756 0.194848 0.202871 0.187868 0.194563 0.229550 0.223836 0.235873 0.217640 0.209086 0.209309 0.226985 0.232747 0.372895
chargesum: 0.00000
title: Mulliken charges with hydrogens summed into heavy atoms:
elementType: O O C C C C C C C C C C C C C C C C C C
charge: -0.050124 -0.237884 0.009233 0.037605 0.037219 0.006745 0.045796 -0.072191 -0.004705 0.055559 0.050403 0.038285 0.034720 0.201404 -0.034266 0.064792 -0.057986 -0.087150 -0.009934 -0.027520
polarizability: 2.04710716e+02 1.06341864e+01 2.30372289e+02 4.24221908e+00 -5.23340627e+00 1.62473677e+02
1716.lowfreq: -15.8191 -9.0107 -1.4406 -0.0004 -0.0003 0.0006 8.5384 14.4624 21.9633
frequency: -1.8236 14.2583 21.8560 26.5026 28.9785 42.1369 46.9754 53.6986 73.4756 86.1597 92.8380 100.8942 113.3583 131.5434 137.1604 149.1671 170.9717 182.5567 211.1211 223.2963 234.7505 246.4004 266.3501 276.4285 310.0766 353.6630 361.8513 383.2948 394.5938 409.7059 457.2984 501.2248 505.2900 512.5710 548.1328 593.7133 656.2836 699.7865 723.9306 733.5788 736.5930 776.2284 790.4438 812.0443 835.8961 837.5771 845.8069 868.1953 902.9522 909.1676 923.0358 933.3132 970.5814 977.5348 980.7435 994.7972 1003.8267 1039.7875 1041.8541 1050.1739 1063.2377 1074.1044 1078.1810 1081.2261 1088.2747 1106.1820 1107.2961 1128.4651 1139.7022 1157.4420 1166.5100 1193.7276 1199.6172 1206.9251 1216.5500 1225.1728 1250.1502 1253.5716 1266.2035 1269.3450 1277.1377 1280.3286 1286.4103 1286.4502 1287.6723 1296.4584 1298.2079 1303.5904 1320.3707 1330.4585 1334.5093 1336.7177 1355.1400 1357.9140 1358.3608 1362.8200 1390.7208 1440.9835 1450.3277 1456.6174 1456.8790 1457.9182 1461.5852 1462.3505 1463.3038 1466.9760 1472.5888 1476.9622 1480.1182 1485.0980 1489.7092 1667.6244 1685.4716 2273.7776 2950.3872 2954.0673 2955.2704 2956.1212 2957.9447 2962.2857 2963.0773 2964.6291 2967.6160 2968.7968 2973.7820 2981.6559 2990.9686 2993.9341 2997.4325 3004.1628 3011.7696 3012.3045 3017.1806 3020.2986 3024.5661 3038.4055 3044.0412 3050.3496 3064.8552 3065.4400 3066.8531 3067.7845 3098.6460 3506.4308
redmass: 3.8515 4.4992 6.0648 4.4461 4.0738 5.0495 4.6092 3.4645 1.6173 2.7183 2.0266 3.0878 2.5888 2.3401 2.0302 2.9430 2.5177 2.3822 2.9427 2.4722 1.1641 2.3474 3.4439 3.0085 4.0831 3.2189 3.1423 2.7076 2.7639 3.6587 3.0433 2.8396 2.3250 2.7668 3.5276 2.5830 1.4297 2.1948 1.0999 1.1532 1.2747 1.6339 1.4170 1.8182 1.9611 1.6564 1.9781 1.7914 1.8728 1.8181 1.5446 1.6316 1.7808 1.4053 1.7828 3.2389 1.5627 2.9486 2.4284 3.0571 2.1795 2.2702 2.1236 2.3672 2.5420 1.7830 1.8571 1.9442 1.4642 2.5528 1.2378 1.3178 1.3897 1.2928 1.3386 1.3962 1.3492 1.4749 1.3209 1.2629 1.2774 1.2366 1.0746 1.0615 1.2190 1.2059 1.2140 1.2657 1.3780 1.3807 1.4374 1.4335 1.6072 1.5838 1.6224 1.6679 1.2162 1.0931 1.0821 1.0859 1.0773 1.0971 1.0734 1.0848 1.0652 1.0754 1.0935 1.0564 1.0652 1.0987 1.0772 8.1085 6.5328 11.6807 1.0594 1.0602 1.0595 1.0608 1.0600 1.0587 1.0607 1.0602 1.0606 1.0369 1.0620 1.0629 1.0934 1.0652 1.0965 1.0977 1.0991 1.0974 1.1008 1.1015 1.1005 1.1035 1.1041 1.1024 1.0994 1.0925 1.0971 1.0999 1.0903 1.0638
irintensity: 0.2227 0.1015 0.3945 0.4178 0.4425 0.7680 0.1224 0.0309 0.0878 0.4867 0.0188 0.2508 0.3333 0.8246 0.9756 0.8609 1.3978 0.1209 3.0772 1.2036 0.5710 7.0751 0.5970 3.1391 2.6334 0.4244 4.1042 0.2864 1.0771 2.5954 6.5751 14.6286 7.3074 31.3200 0.4327 18.9893 167.9191 4.7784 15.0230 6.5694 1.1667 2.4923 1.3305 1.0956 1.3320 0.5358 9.6811 2.7067 1.1020 6.4075 1.5491 5.2918 19.3010 43.6397 13.8089 39.7548 4.9685 26.5183 165.1556 2.2321 10.8505 1.4642 7.0281 5.3406 3.7793 4.0311 1.2623 15.4720 15.7324 0.2194 8.0462 1.2852 0.2044 0.6568 0.9509 2.1447 5.4346 1.6742 1.8861 0.2750 7.1648 1.9331 0.8294 0.2447 0.2064 0.4836 1.2962 4.1757 7.2590 1.8198 3.6999 3.9651 0.8590 2.9016 12.1190 28.5739 8.5993 30.2009 8.7717 11.9453 2.1071 11.6733 3.4269 4.7584 0.4307 1.0276 2.5860 6.1955 8.3575 33.3241 6.7859 177.6160 0.2771 0.8497 2.6289 5.4769 3.2405 36.4835 10.7172 33.5011 80.4061 30.4326 115.3367 23.4704 79.8290 38.9532 5.1080 31.2616 2.6205 6.0118 30.6438 11.4543 17.8572 12.8372 13.4226 59.6807 68.7749 67.1439 81.7559 23.4697 30.6327 82.0584 27.9051 17.7541
temp: 298.150 k
press: 1.00000 atm
elementType: 8 8 6 6 6 6 6 6 6 6 6 6 6 6 6 6 6 6 6 6 1 1 1 1 1 1 1 1 1 1 1 1 1 1 1 1 1 1 1 1 1 1 1 1 1 1 1 1 1 1
symmnumber: 1
zpe: 1147343.9 jmol-1
zpe.correction: 0.437000 hartree
zpe.thermalcorrener: 0.461359 hartree
zpe.thermalcorrenthalpy: 0.462303 hartree
zpe.thermalcorrgfe: 0.378436 hartree
zpe.sumelectzpe: -852.703332 hartree
zpe.sumelectthermal: -852.678973 hartree
zpe.sumelectthermalent: -852.678029 hartree
zpe.sumelectthermalfe: -852.761896 hartree
dipole: -0.0701 0.5809 -1.0872
dipole: 1.2347
quadrupole: -128.2212 -118.1406 -122.1211
quadrupole: 7.5202 -4.8201 4.3326
quadrupole: -5.3936 4.6870 0.7065 7.5202 -4.8201 4.3326
hfenergy: -853.140332 hartree
pointgroup: C01 [X(C18H30O2)]
dipole: 0.03638 0.2286575 0.4270273 debye
polarizability: 203.2648372|-8.8763271|231.7251201|5.2403876|4.4124437|162.5667251 unknown
InChI: InChI=1S/C18H30O2/c1-2-3-4-5-6-7-8-9-10-11-12-13-14-15-16-17-18(19)20/h9-10,19H,2-5,8,11-17H2,1H3
charge 0 multiplicity 1
50 atoms
O  -4.918139 1.726074 -0.081329
O  -5.026339 -0.37124 -1.067255
C  -1.263556 -2.609847 0.384336
C  0.0979 -2.432598 -0.324298
C  -2.082076 -1.301331 0.442397
C  0.930587 -3.731988 -0.382966
C  -3.433219 -1.46685 1.173759
C  2.334332 -3.532154 -1.026348
C  -4.235229 -0.151202 1.274884
C  3.240306 -2.658184 -0.183491
C  0.59711 2.702458 -0.228262
C  1.811019 3.611277 0.064639
C  -0.259032 3.211772 -1.410177
C  -4.749291 0.329564 -0.06953
C  2.715616 3.093292 1.220537
C  3.706057 -1.434041 -0.539346
C  -1.495613 2.328715 -1.684483
C  4.584924 -0.556022 0.345152
C  3.380529 1.808933 0.92139
C  3.944763 0.740014 0.664126
H  -1.855896 -3.390894 -0.136583
H  -1.092376 -2.983111 1.416259
H  0.683405 -1.646829 0.193792
H  -0.072052 -2.062909 -1.357644
H  -1.480364 -0.517615 0.949546
H  -2.265812 -0.941705 -0.590206
H  1.055004 -4.13698 0.643133
H  0.376549 -4.501349 -0.958501
H  -4.046255 -2.223973 0.648363
H  -3.253398 -1.847181 2.198726
H  2.216032 -3.088917 -2.034958
H  2.805348 -4.527286 -1.164523
H  -3.638805 0.656669 1.734796
H  -5.123942 -0.293016 1.923366
H  3.503157 -3.056592 0.810751
H  -0.036769 2.629929 0.68086
H  0.953503 1.675267 -0.445413
H  1.455055 4.627361 0.331461
H  2.424463 3.716114 -0.851923
H  -0.585138 4.25252 -1.205369
H  0.373856 3.257866 -2.320091
H  3.486543 3.856298 1.449306
H  2.101373 2.984183 2.137879
H  3.434646 -1.009734 -1.517087
H  -2.1779 2.31587 -0.813305
H  -2.067269 2.695163 -2.557566
H  -1.196075 1.283685 -1.89208
H  4.823328 -1.096872 1.282179
H  5.553781 -0.364007 -0.161673
H  -5.28134 2.001602 -0.967228
