program: Gaussian 09
title: 000128837
version: EM64L-G09RevD.01
frameworkgroup: C1[X(C12H26N4O3)]
method: RPBEPBE
basis: SDD
operation: Freq
keyword: #p
keyword: freq=noraman
keyword: PBEPBE/SDD
title: #p freq=noraman PBEPBE/SDD
converged: NO YES NO NO
title: Mulliken charges:
elementType: O O O N N N N C C C C C C C C C C C C H H H H H H H H H H H H H H H H H H H H H H H H H H
charge: -0.280876 -0.403376 -0.237186 -0.402875 -0.585439 -0.570575 -0.544865 -0.144873 -0.386548 -0.226622 -0.411843 -0.344656 -0.356842 -0.362376 0.225381 -0.361757 -0.402368 0.134708 -0.415459 0.290771 0.201732 0.230387 0.212133 0.194146 0.222775 0.206740 0.217143 0.211251 0.181968 0.322756 0.181712 0.217730 0.191003 0.183456 0.186531 0.210629 0.209664 0.207719 0.257688 0.302035 0.273160 0.257513 0.259906 0.260812 0.387088
chargesum: 0.00000
title: Mulliken charges with hydrogens summed into heavy atoms:
elementType: O O O N N N N C C C C C C C C C C C C
charge: -0.280876 -0.016288 -0.237186 -0.080120 -0.025716 -0.039902 -0.024147 0.145897 0.045572 -0.014488 0.005077 0.079226 0.036378 0.037066 0.225381 0.012702 -0.005207 0.134708 0.001923
polarizability: 2.01075309e+02 -6.15343824e+00 1.72017617e+02 6.63252843e+00 -2.35428794e+00 1.35727585e+02
1716.lowfreq: -7.6976 -5.6683 -0.0010 -0.0006 0.0006 5.8383 14.8125 18.6186 36.9962
frequency: 13.0833 17.7288 36.9732 44.6838 48.0048 52.8400 55.7195 66.8694 80.6429 88.1027 111.3467 121.0655 130.7487 136.5084 147.4444 167.0101 182.9586 221.8482 242.8299 253.4520 263.7537 267.4689 294.3872 299.3389 307.8444 336.3882 371.2123 423.5869 434.7208 467.8880 493.5633 540.9810 581.0903 600.8888 605.8933 610.9838 612.9288 650.0931 666.0149 700.2235 721.0719 728.6607 737.8721 774.0265 790.0754 836.2631 887.5871 893.8728 939.3158 942.8659 976.6942 992.1381 1003.1226 1015.0044 1032.0182 1048.5857 1051.4468 1060.9764 1066.5019 1087.1130 1093.3571 1095.3051 1098.9026 1116.6484 1124.2621 1148.7470 1175.4394 1209.0339 1220.4508 1225.4302 1230.5111 1238.7568 1251.7020 1278.9406 1280.2271 1287.2331 1290.9671 1295.4532 1297.7318 1314.5019 1315.1292 1327.8754 1335.0628 1336.2487 1347.8162 1354.0815 1358.7899 1388.6364 1389.5769 1452.8011 1456.1338 1457.4349 1463.2421 1466.0810 1477.3876 1480.2491 1493.4018 1494.2291 1587.9193 1639.6105 1641.6548 1644.6331 1650.7749 2873.5523 2951.4312 2955.5038 2955.8581 2960.8624 2965.8689 2975.1428 2982.5909 2986.1627 2994.0701 3010.3670 3013.4979 3022.7841 3027.5466 3037.4896 3041.8070 3048.9841 3063.0207 3435.6709 3449.0657 3449.3845 3513.4413 3527.8367 3569.6384 3574.9840 3576.2617
redmass: 5.3550 5.5632 4.5543 2.6260 2.7213 1.8514 4.8444 3.9563 5.2139 3.7551 3.1772 3.5749 1.9251 1.9133 3.2828 3.3543 2.7936 1.9770 2.6387 1.9845 1.1084 3.0122 2.9954 1.5798 3.1781 5.1351 3.5116 3.4718 2.8261 2.9869 2.9377 3.2438 1.5680 1.2833 2.0291 1.5623 1.4584 1.8076 1.9049 3.6580 3.1139 1.2264 1.1164 1.3412 1.2270 3.3840 1.5372 1.4919 2.3837 2.9098 3.6906 2.0620 1.7474 2.1978 3.0732 3.4083 2.7005 2.4919 2.3897 2.6579 2.9245 2.0434 2.1177 2.3079 1.9725 1.5423 1.8281 1.3373 1.5440 1.4575 1.5146 1.3337 1.4364 1.2892 1.2913 1.0658 1.0591 1.2001 1.1748 1.2650 1.3090 1.3172 1.2081 1.8218 1.4713 1.3516 1.5204 1.4441 1.6068 1.0855 1.1086 1.0692 1.0742 1.0905 1.1000 1.1026 1.1070 1.9767 2.3180 1.0941 1.7814 1.0890 5.1327 1.0713 1.0598 1.0640 1.0608 1.0809 1.0646 1.0612 1.0609 1.0601 1.0948 1.0864 1.1002 1.0927 1.0879 1.1038 1.0995 1.1051 1.1034 1.0449 1.0448 1.0445 1.0642 1.0774 1.0969 1.0973 1.0973
irintensity: 0.0654 0.3010 0.9766 1.4820 1.6936 1.6925 11.0367 2.3101 0.8182 1.8346 2.4692 0.9623 2.6921 0.4001 0.6374 1.5980 6.2284 30.3493 15.3104 14.4957 55.3341 38.3009 7.1879 54.9748 6.1066 3.0538 2.0540 15.8452 12.8801 46.1498 11.5462 13.8414 12.8145 196.8331 122.2938 382.7012 146.2704 131.5814 110.9109 38.8481 0.7624 9.3064 12.1352 3.6340 0.7674 10.6417 1.1341 1.1383 8.8136 5.2682 31.9173 2.4604 0.5402 6.8879 14.0543 60.8759 120.2006 42.8925 2.1701 12.0916 22.1333 3.7104 14.0806 16.2853 11.2922 6.2248 9.1118 13.1954 20.8900 3.9629 8.9416 6.6655 16.9823 0.9412 6.0103 1.6813 1.3630 1.4419 8.5307 10.4314 5.2228 8.5881 6.0173 100.1873 6.2355 5.2558 4.5707 17.5727 8.4945 0.8534 21.8452 2.2353 1.1902 0.3711 19.6242 6.9878 2.5156 210.9949 207.7354 37.8873 97.9524 32.8629 132.1617 102.2272 1.1249 24.8224 18.4040 27.3094 79.0640 6.3661 64.0799 49.0652 10.9703 24.3705 6.1134 7.3730 12.0458 6.5148 14.1226 132.2800 86.9644 10.7761 1.8892 1.2035 32.9244 33.3908 5.7492 0.0856 0.1250
temp: 298.150 k
press: 1.00000 atm
elementType: 8 8 8 7 7 7 7 6 6 6 6 6 6 6 6 6 6 6 6 1 1 1 1 1 1 1 1 1 1 1 1 1 1 1 1 1 1 1 1 1 1 1 1 1 1
symmnumber: 1
zpe: 1017600.5 jmol-1
zpe.correction: 0.387584 hartree
zpe.thermalcorrener: 0.411731 hartree
zpe.thermalcorrenthalpy: 0.412676 hartree
zpe.thermalcorrgfe: 0.329914 hartree
zpe.sumelectzpe: -916.001629 hartree
zpe.sumelectthermal: -915.977481 hartree
zpe.sumelectthermalent: -915.976537 hartree
zpe.sumelectthermalfe: -916.059299 hartree
dipole: -0.4496 -0.7174 -1.2825
dipole: 1.5368
quadrupole: -119.5865 -108.3235 -118.1972
quadrupole: 8.8630 -8.2812 4.3854
quadrupole: -4.2174 7.0456 -2.8281 8.8630 -8.2812 4.3854
hfenergy: -916.3892128 hartree
pointgroup: C01 [X(C12H26N4O3)]
dipole: -0.1762808 -0.2742788 -0.5091788 debye
polarizability: 200.3401265|-7.097035|172.4858889|7.8080752|-2.5879261|135.994496 unknown
InChI: InChI=1S/C12H26N4O3/c13-7-3-1-5-9(15)11(17)16-10(12(18)19)6-2-4-8-14/h9-10,16,18H,1-8,13-15H2
charge 0 multiplicity 1
45 atoms
O  0.285685 -1.288475 1.260672
O  0.696656 3.581461 0.558711
O  -0.566882 2.711406 -1.185633
N  0.226328 0.138948 -0.576008
N  -0.366834 -3.362504 -0.511689
N  6.946441 -1.012293 -0.287537
N  -6.760993 0.882204 -0.083367
C  0.95207 1.227909 0.087609
C  2.462906 1.295957 -0.307881
C  -0.96779 -2.029943 -0.714502
C  -2.453225 -1.921081 -0.237274
C  3.240457 0.026064 0.096508
C  -3.1463 -0.578468 -0.562752
C  4.732751 0.116165 -0.291101
C  -0.095198 -1.035309 0.073765
C  -4.638123 -0.559931 -0.156455
C  5.527749 -1.144147 0.107559
C  0.261736 2.542396 -0.261685
C  -5.3362 0.793532 -0.463351
H  0.886033 1.051159 1.177769
H  2.541998 1.455026 -1.402711
H  2.903703 2.182714 0.186033
H  -0.930929 -1.776281 -1.794644
H  -3.015745 -2.746995 -0.721058
H  -2.477813 -2.109393 0.854592
H  3.143662 -0.130419 1.18917
H  2.780964 -0.859661 -0.383568
H  -2.622339 0.252404 -0.048542
H  -3.063131 -0.369695 -1.651293
H  -0.165984 0.334256 -1.501042
H  4.820824 0.26928 -1.388572
H  5.209399 0.99235 0.189761
H  -4.728474 -0.773979 0.929304
H  -5.179873 -1.373807 -0.683419
H  5.017108 -2.040002 -0.324858
H  5.490095 -1.258238 1.208102
H  -4.792424 1.608475 0.053264
H  -5.256058 1.009003 -1.546859
H  -0.965122 -4.135367 -0.820153
H  -0.030057 -3.479746 0.452286
H  7.564165 -1.727032 0.109647
H  7.082522 -0.914792 -1.299542
H  -7.370777 0.241922 -0.602451
H  -6.92557 0.819525 0.926699
H  0.256088 4.431899 0.286402
