program: Gaussian 09
title: 000128794
version: EM64L-G09RevD.01
frameworkgroup: C1[X(C13H15N3)]
method: RPBEPBE
basis: SDD
operation: Freq
keyword: #pfreq=noraman
keyword: PBEPBE/SDD
title: #p freq=noraman PBEPBE/SDD
converged: YES YES NO NO
title: Mulliken charges:
elementType: N N N C C C C C C C C C C C C C H H H H H H H H H H H H H H H
charge: -0.481109 -0.281451 -0.017295 -0.572276 0.429327 -0.352607 0.202865 0.299417 -0.569622 -0.347027 -0.369419 -0.426627 -0.219522 -0.251004 -0.431673 -0.148639 0.224004 0.231106 0.212171 0.208789 0.300787 0.259016 0.248567 0.210310 0.229203 0.228657 0.236602 0.220601 0.219814 0.268490 0.238548
chargesum: 0.00000
title: Mulliken charges with hydrogens summed into heavy atoms:
elementType: N N N C C C C C C C C C C C C C
charge: -0.180322 -0.032884 -0.017295 -0.117166 0.429327 0.068353 0.202865 0.299417 -0.310606 0.092485 -0.140763 -0.190025 0.001079 -0.031190 0.075364 -0.148639
polarizability: 2.40368715e+02 -8.18756574e+00 1.39684541e+02 1.57901037e+01 8.35750765e+00 1.01891507e+02
1716.lowfreq: -7.9186 -2.7788 -0.0009 -0.0004 -0.0004 5.0209 16.3948 29.0494 42.9854
frequency: 16.2162 29.0316 42.9624 51.3756 84.9758 116.8527 135.0202 170.6589 174.6079 245.3691 248.3965 301.0219 361.2669 376.0204 406.4316 437.4276 455.3127 505.6911 515.5267 544.7615 575.6907 603.6915 642.3791 682.8792 710.8445 744.0935 754.4271 781.0775 791.5059 808.4504 818.8995 854.5320 880.7119 930.5365 931.3630 970.5835 973.4813 1005.7786 1011.8956 1014.8271 1023.3443 1055.7334 1087.3183 1113.1717 1142.9218 1144.4875 1154.0599 1165.4780 1215.4645 1226.8808 1235.9841 1261.2948 1275.5592 1284.0359 1293.4879 1304.4798 1336.3538 1342.5032 1386.1649 1388.8774 1419.8737 1447.9658 1459.5453 1461.8708 1468.2524 1483.0739 1486.9764 1498.5474 1562.6517 1595.9214 1631.8440 2199.9740 2893.4925 2900.6305 2983.8538 2994.1907 3004.4592 3032.5909 3047.7868 3063.1855 3122.5247 3130.4604 3144.4248 3162.1750 3211.1723 3419.7531 3600.9278
redmass: 4.6994 5.0268 2.2690 4.2178 5.4045 2.0072 3.1857 5.0697 6.1281 3.8141 2.9596 4.7884 4.4546 3.5741 3.8693 3.0848 3.4442 1.9225 2.0553 5.0115 3.5215 6.6051 3.5158 1.6344 2.7013 1.2731 3.1737 1.1822 1.2196 1.5641 2.7350 1.5457 5.0919 1.5698 3.4508 1.3049 4.6517 2.2145 2.2945 2.4337 2.2687 2.9621 1.8538 1.6440 3.4832 1.2395 1.3618 1.0869 1.4857 2.1829 1.3460 1.2642 1.2068 1.1216 1.5965 2.6224 1.5595 1.3664 1.4612 3.7018 2.6916 1.0854 1.2413 2.7813 1.2849 2.9026 1.0926 1.0831 6.4414 5.6543 7.1677 12.4336 1.0700 1.0706 1.0603 1.0616 1.0902 1.0885 1.1013 1.0998 1.0849 1.0890 1.0953 1.1002 1.0979 1.0739 1.0803
irintensity: 2.7974 1.8601 1.3143 1.8538 4.9201 2.6733 5.0202 3.9584 2.3448 0.3325 1.7784 2.5734 3.5450 1.1590 7.5561 3.1193 1.4439 41.5010 29.1434 9.4774 0.2054 1.5688 38.9725 79.0944 7.2730 54.4524 24.6652 3.1726 3.9423 52.0116 12.2321 6.1386 0.5147 3.2323 3.9001 0.0785 4.2500 1.7595 12.5094 1.8219 8.1442 1.6508 3.3449 3.7195 92.6099 15.7763 10.2344 2.5798 6.1483 3.4433 14.2592 8.3949 1.2144 0.6019 0.8298 43.9303 3.2732 13.6326 12.2199 43.4446 15.0676 10.8442 45.2890 19.5834 2.7015 2.4960 5.3225 7.1890 13.7179 8.7251 1.4732 15.7721 37.9396 115.4342 38.9374 8.6226 15.2921 16.2045 33.8061 15.8049 1.2043 3.7267 37.2590 33.7655 5.2719 1.1486 40.0535
temp: 298.150 k
press: 1.00000 atm
elementType: 7 7 7 6 6 6 6 6 6 6 6 6 6 6 6 6 1 1 1 1 1 1 1 1 1 1 1 1 1 1 1
symmnumber: 1
zpe: 667350.6 jmol-1
zpe.correction: 0.254180 hartree
zpe.thermalcorrener: 0.269371 hartree
zpe.thermalcorrenthalpy: 0.270316 hartree
zpe.thermalcorrgfe: 0.208759 hartree
zpe.sumelectzpe: -667.461532 hartree
zpe.sumelectthermal: -667.446341 hartree
zpe.sumelectthermalent: -667.445397 hartree
zpe.sumelectthermalfe: -667.506953 hartree
dipole: -1.4929 -1.3910 1.8162
dipole: 2.7317
quadrupole: -137.6316 -87.3051 -98.4891
quadrupole: -17.1356 11.8460 6.7797
quadrupole: -29.8230 20.5035 9.3195 -17.1356 11.8460 6.7797
hfenergy: -667.7157124 hartree
pointgroup: C01 [X(C13H15N3)]
dipole: -0.5983146 -0.621401 0.6410655 debye
polarizability: 239.7550617|-9.5176016|137.4576712|17.7586145|11.9454413|104.7320301 unknown
InChI: InChI=1S/C13H15N3/c14-7-3-8-15-9-6-12-10-11-4-1-2-5-13(11)16-12/h1-2,4-5,10,15-16H,3,6,8-9H2
charge 0 multiplicity 1
31 atoms
N  -1.470883 0.465649 0.854211
N  2.95285 -0.623571 0.429762
N  7.401102 1.214736 -0.583928
C  0.539287 -1.082459 0.814377
C  -0.884054 -0.752485 0.454888
C  1.581583 -0.283741 -0.012754
C  -2.784026 0.53995 0.371895
C  -3.032532 -0.675104 -0.363797
C  -1.821258 -1.466998 -0.293528
C  4.029312 0.134813 -0.235347
C  -3.758927 1.550344 0.5180
C  -4.304202 -0.861405 -0.968037
C  -5.012138 1.336962 -0.09306
C  -5.280766 0.144385 -0.82829
C  5.371918 -0.132177 0.498502
C  6.498632 0.605909 -0.09498
H  0.699451 -2.164401 0.647229
H  0.739414 -0.893524 1.887716
H  1.404242 -0.474307 -1.09838
H  1.433386 0.802311 0.147436
H  -1.017324 1.16655 1.436862
H  -1.655236 -2.447114 -0.738635
H  3.118453 -1.63981 0.380291
H  4.148182 -0.100752 -1.31981
H  3.788532 1.211623 -0.165107
H  -3.557769 2.468346 1.081895
H  -4.522946 -1.773677 -1.534305
H  -5.793186 2.100052 -0.00176
H  -6.26598 0.01348 -1.289749
H  5.2586 0.150863 1.561025
H  5.606982 -1.21465 0.474781
