program: Gaussian 09
title: 000011987
version: EM64L-G09RevD.01
frameworkgroup: C1[X(C7H4ClNS)]
method: RPBEPBE
basis: SDD
operation: Freq
keyword: #p
keyword: freq=noraman
keyword: PBEPBE/SDD
title: #p freq=noraman PBEPBE/SDD
converged: NO NO NO NO
title: Mulliken charges:
elementType: Cl S N C C C C C C C H H H H
charge: 0.045058 0.323238 0.084363 -0.346236 0.350978 -0.263029 -0.312206 -0.231899 -0.207370 -0.426221 0.249634 0.262029 0.235170 0.236488
chargesum: 0.00000
title: Mulliken charges with hydrogens summed into heavy atoms:
elementType: Cl S N C C C C C C C
charge: 0.045058 0.323238 0.084363 -0.346236 0.350978 -0.013395 -0.050177 0.003271 0.029118 -0.426221
polarizability: 1.70394571e+02 -2.51877898e+00 1.03645921e+02 2.75338171e-04 1.11096136e-03 3.83228881e+01
1716.lowfreq: 0.0025 0.0026 0.0036 11.1958 12.6647 15.6289 103.5310 188.1123 196.8008
frequency: 103.5283 188.1111 196.8004 289.1830 345.8311 368.8744 427.4592 486.7071 502.4056 570.3289 579.7036 610.3887 674.8044 730.1786 767.7286 829.2565 866.8638 907.3512 951.5720 989.3594 1015.7481 1038.1145 1118.3145 1169.8791 1219.8140 1274.3739 1373.8643 1428.7746 1444.8643 1484.3971 1566.7987 1604.3092 3138.8533 3152.8863 3166.9586 3177.9735
redmass: 8.1484 5.7750 10.6533 6.6948 17.5155 9.4015 3.2162 8.6728 6.5072 10.0204 4.7034 10.2137 7.3000 2.9126 1.4774 6.8751 1.3690 11.1438 1.3801 1.3215 2.2351 5.3906 1.5725 1.1417 2.7119 1.5627 4.7842 2.8690 2.5458 12.1504 6.2209 7.1820 1.0860 1.0906 1.0960 1.0995
irintensity: 1.0303 2.1283 0.5855 0.0877 5.8554 2.0591 8.2126 0.8589 2.3160 3.0436 1.2842 23.8575 6.7336 16.9980 82.2737 6.2447 1.2208 173.9893 2.8298 0.0618 4.3044 9.5204 3.2885 0.1975 0.6856 0.1568 11.3181 52.2162 8.8004 154.8200 0.6865 10.4343 1.9066 7.7991 12.4777 12.6881
temp: 298.150 k
press: 1.00000 atm
elementType: 17 16 7 6 6 6 6 6 6 6 1 1 1 1
symmnumber: 1
zpe: 237831.7 jmol-1
zpe.correction: 0.090585 hartree
zpe.thermalcorrener: 0.098424 hartree
zpe.thermalcorrenthalpy: 0.099368 hartree
zpe.thermalcorrgfe: 0.057196 hartree
zpe.sumelectzpe: -1181.319412 hartree
zpe.sumelectthermal: -1181.311574 hartree
zpe.sumelectthermalent: -1181.310630 hartree
zpe.sumelectthermalfe: -1181.352801 hartree
dipole: 2.7416 1.2500 0.0001
dipole: 3.0131
quadrupole: -63.3010 -68.3816 -74.7830
quadrupole: -1.5511 0.0001 0.0001
quadrupole: 5.5209 0.4403 -5.9611 -1.5511 0.0001 0.0001
hfenergy: -1181.4099975 hartree
pointgroup: C01 [X(C7H4Cl1N1S1)]
dipole: 1.080037 0.4886807 0.0000291 debye
dipolederiv: -0.9501662 -0.1213501 0.0000021 -0.1395586 -0.1057442 -0.0000018 0.0000284 0.0000009 -0.0006735 -0.4086567 -0.1082882 -0.0000012 -0.0722716 -0.3755174 -0.0000118 0.0000085 -0.0000183 0.1502535 -0.7951865 0.2531831 0.0000143 0.2975136 -0.7010539 -0.0000196 0.0000177 -0.000001 -0.1211266 0.4350187 -0.2202742 -0.0000085 -0.3126803 -0.092847 0.0000012 -0.0000087 -0.0000005 -0.1011631 0.3106407 -0.0520422 -0.0000023 0.1318816 0.0053172 -0.0000021 0.0000098 -0.000004 0.0528505 -0.1737621 0.0815737 0.0000035 0.1402057 0.0834145 0.0000046 -0.0000013 0.0000066 -0.1153611 0.0022322 0.0528225 0.0000042 0.001761 0.0983079 0.0000038 -0.0000022 0.0000053 -0.1342341 0.0234967 0.0409609 0.000005 0.0079007 0.0666745 0.0000058 0.0000077 0.0000052 -0.1577719 0.0218949 -0.1287823 0.0000009 -0.134986 -0.0361996 -0.0000022 0.0000015 -0.0000014 -0.1607432 1.5051886 0.1968148 -0.0000101 0.078555 1.0642062 0.0000326 -0.00005 0.00002 -0.0838262 0.088295 0.0130283 0. -0.0333547 -0.0504707 -0.0000039 -0.0000006 -0.0000059 0.1695908 0.0866892 -0.0323313 -0.0000014 0.0032018 -0.0392428 -0.0000035 -0.0000017 -0.0000038 0.1715063 -0.0895775 -0.07082 -0.0000049 -0.0661623 0.0575384 -0.0000028 -0.0000074 -0.0000031 0.1657159 -0.0561069 0.0955051 -0.0000016 0.097994 0.0256171 -0.0000005 -0.0000017 0. 0.1649825 unknown
polarizability: 170.3794466|-2.7117478|103.6610462|0.0002785|0.0011102|38.3228881 unknown
InChI: InChI=1S/C7H4ClNS/c8-7-9-5-3-1-2-4-6(5)10-7/h1-4H
charge 0 multiplicity 1
14 atoms
Cl -3.836532 -0.283683 -0.000001
S  -1.361386 1.612759 0.000025
N  -1.218941 -1.08589 -0.000036
C  0.273071 0.806395 0.000003
C  0.117325 -0.621489 -0.000022
C  1.543988 1.410347 0.000018
C  1.262358 -1.451563 -0.000023
C  2.676648 0.56429 0.000019
C  2.536132 -0.85061 0.0000
C  -2.059468 -0.09009 -0.000032
H  1.66135 2.498178 0.000039
H  1.1337 -2.537884 -0.000041
H  3.677474 1.009004 0.000045
H  3.431983 -1.480463 0.000006
