program: Gaussian 09
title: 000128775
version: EM64L-G09RevD.01
frameworkgroup: C1[X(C16H24N4O3)]
method: RPBEPBE
basis: SDD
operation: Freq
keyword: #p
keyword: freq=noraman
keyword: PBEPBE/SDD
title: #p freq=noraman PBEPBE/SDD
converged: YES YES NO NO
title: Mulliken charges:
elementType: O O O N N N N C C C C C C C C C C C C C C C C H H H H H H H H H H H H H H H H H H H H H H H H
charge: -0.224051 -0.416470 -0.235764 -0.590044 -0.116023 -0.658896 -0.634311 -0.116684 -0.602613 -0.198605 -0.396983 0.214875 -0.617661 -0.391562 0.473699 0.138439 -0.465121 -0.411632 -0.405995 -0.232827 -0.230142 -0.242895 0.212037 0.294987 0.268227 0.282556 0.219106 0.201012 0.247366 0.231675 0.228074 0.198369 0.201849 0.196776 0.204363 0.263846 0.295902 0.251665 0.255120 0.222416 0.222473 0.377821 0.224841 0.311150 0.337732 0.293767 0.318134
chargesum: 0.00000
title: Mulliken charges with hydrogens summed into heavy atoms:
elementType: O O O N N N N C C C C C C C C C C C C C C C C
charge: -0.224051 -0.038649 -0.235764 -0.030295 -0.116023 -0.010013 -0.022410 0.178303 -0.051830 0.020501 0.051395 0.214875 -0.157912 0.008656 0.473699 0.138439 -0.063982 -0.159967 -0.150875 -0.010411 -0.007670 -0.018054 0.212037
polarizability: 2.66410914e+02 -1.64662209e+01 1.83846597e+02 -7.21955754e+00 -1.10775628e+01 1.84100077e+02
1716.lowfreq: -10.0602 -1.9060 -0.0009 -0.0006 0.0006 7.0964 9.2443 16.1723 19.0224
frequency: 8.3071 16.1388 18.8296 26.3488 32.3262 35.1238 43.7726 46.8667 73.4211 84.1348 100.7923 140.8768 147.9127 165.4515 178.6369 192.2558 229.2712 244.9138 256.6718 269.2082 276.8310 307.7795 320.4525 350.1366 360.8148 363.8940 401.5599 403.3726 428.8886 435.1172 441.8002 462.2634 489.4174 512.5844 547.5081 560.0988 567.9056 581.8961 591.9255 607.2609 617.6025 634.1786 654.3431 674.9743 705.6647 707.1912 747.2408 759.3298 791.9344 808.6535 837.8483 857.2062 866.9815 880.4493 896.0188 924.0283 965.4784 971.9636 978.9531 981.0196 989.4664 993.9921 1010.1340 1026.9513 1028.4656 1030.8473 1036.3140 1057.1310 1070.4408 1075.1761 1084.7768 1107.2679 1127.4151 1151.0051 1163.4295 1171.2361 1179.3619 1185.1314 1188.7739 1204.4709 1217.3686 1223.8629 1238.9993 1278.0067 1284.1866 1289.9704 1299.8281 1315.6338 1328.0689 1333.2832 1343.5404 1356.3016 1359.9112 1383.6823 1387.9841 1410.8367 1425.2675 1442.1310 1452.3468 1460.2408 1462.7502 1467.0438 1484.1152 1592.6744 1597.5741 1601.1849 1614.5066 1614.8250 1641.1371 1658.2554 1670.3972 2876.8861 2920.5045 2967.2203 2971.1162 2975.6990 2981.2465 3003.6187 3021.6490 3028.2512 3043.6413 3047.8941 3064.9694 3114.8742 3122.0907 3134.3503 3144.6637 3160.8172 3446.7728 3512.8451 3526.6194 3552.3299 3579.1794 3675.1848 3697.7968
redmass: 5.1594 5.1403 4.4207 4.4673 4.4967 4.7856 7.5280 4.8090 5.6996 5.1363 5.5662 3.7601 3.4441 4.6544 3.1350 2.8936 4.7561 3.1325 4.1077 2.3205 1.1537 2.9317 4.5169 2.0323 3.1230 1.2461 1.2770 2.8295 1.2919 3.0627 2.1065 2.8310 2.5167 2.9420 1.7851 1.9432 2.5317 2.9044 2.9161 1.7353 6.1830 1.5595 2.4379 5.6257 2.2930 2.6339 1.9018 1.6757 2.6102 3.3273 2.9952 1.2593 2.1758 2.9232 1.9691 1.4475 3.2198 2.3797 1.4154 2.8373 4.6692 1.4129 3.0436 2.2462 2.0111 1.6036 2.9854 2.0048 2.1195 2.1514 2.0292 2.4214 1.7158 1.3162 1.1967 1.0611 2.1163 1.5415 1.1354 1.3216 2.4031 1.2618 1.4702 1.2621 1.4059 1.1722 1.2013 1.4573 1.3329 1.4174 1.4145 1.8213 1.3920 6.2729 1.6053 4.3035 1.0937 2.1443 1.0920 1.0868 1.1172 1.1032 2.2871 5.8139 2.1366 1.2293 5.5827 1.3095 1.7866 7.5296 3.6177 1.0550 1.1012 1.0660 1.0653 1.0624 1.0728 1.0596 1.1001 1.0863 1.0930 1.1037 1.1024 1.0863 1.0867 1.0920 1.0962 1.1015 1.0447 1.0640 1.0450 1.0454 1.0974 1.1020 1.1029
irintensity: 0.7764 1.1428 0.2071 0.9376 1.4799 1.3927 1.0972 1.7123 0.0222 3.9303 2.8079 2.6876 4.7573 1.3359 2.0872 4.0436 3.5491 6.5113 2.9332 1.7648 60.6164 2.4175 11.6898 1.9977 4.3246 90.4292 179.4577 0.0115 133.2159 4.3402 32.2890 12.1489 9.2164 37.2506 171.9673 99.4168 38.6279 20.7241 12.2464 82.1814 0.9501 261.2404 47.1156 59.7741 43.4984 36.7067 35.3599 12.7278 2.9192 3.4281 9.1161 0.2953 6.7455 10.9025 2.3089 0.4974 19.2549 16.0313 0.8165 0.7241 0.0539 0.2901 81.8064 17.8651 53.6393 3.6444 143.1965 23.3552 29.8044 15.9251 10.1062 16.9887 2.6660 14.9838 4.2514 0.2148 2.2991 12.1008 0.0188 32.1770 2.8468 7.3117 8.0662 7.9240 52.3939 3.2000 5.4972 40.9554 6.9510 1.2589 31.5959 20.4482 24.4289 0.9570 27.5474 124.3839 30.8096 6.8356 3.8240 23.8262 19.0773 6.7329 22.5389 10.7900 131.8973 132.4393 19.9285 73.6980 41.1227 181.5226 634.6478 68.6973 47.8956 1.9040 15.3765 72.4408 48.6000 29.9446 10.6684 7.1621 17.4811 45.9593 6.7103 4.3161 0.2517 18.1337 35.4985 26.8743 8.1640 24.0694 22.0165 19.6852 7.0056 19.9827 20.3993
temp: 298.150 k
press: 1.00000 atm
elementType: 8 8 8 7 7 7 7 6 6 6 6 6 6 6 6 6 6 6 6 6 6 6 6 1 1 1 1 1 1 1 1 1 1 1 1 1 1 1 1 1 1 1 1 1 1 1 1
symmnumber: 1
zpe: 1018451.2 jmol-1
zpe.correction: 0.387908 hartree
zpe.thermalcorrener: 0.413009 hartree
zpe.thermalcorrenthalpy: 0.413953 hartree
zpe.thermalcorrgfe: 0.327143 hartree
zpe.sumelectzpe: -1067.026686 hartree
zpe.sumelectthermal: -1067.001585 hartree
zpe.sumelectthermalent: -1067.000641 hartree
zpe.sumelectthermalfe: -1067.087451 hartree
dipole: -5.4814 -2.4971 0.8422
dipole: 6.0820
quadrupole: -98.4709 -132.7031 -139.0847
quadrupole: 14.2394 1.9496 5.6504
quadrupole: 24.9486 -9.2835 -15.6651 14.2394 1.9496 5.6504
hfenergy: -1067.4145933 hartree
pointgroup: C01 [X(C16H24N4O3)]
dipole: 2.1533319 -0.8264399 -0.637013 debye
polarizability: 265.5602033|19.5122107|178.9370171|-5.0463866|8.9192143|189.8603669 unknown
InChI: InChI=1S/C16H24N4O3/c17-13(7-4-8-20-16(18)19)14(21)10-12(15(22)23)9-11-5-2-1-3-6-11/h1-3,5-6,12-13,22H,4,7-10,17-19H2
charge 0 multiplicity 1
47 atoms
O  -0.314663 1.187768 2.142287
O  -3.02808 2.941667 -1.242206
O  -2.708888 1.090486 -2.6022
N  2.03811 2.603603 2.50185
N  5.023472 -0.37189 -0.478002
N  6.224442 -2.356808 -1.202595
N  7.322962 -0.296688 -0.958098
C  -1.780188 1.105403 -0.294415
C  -0.385063 1.784006 -0.226651
C  1.800028 1.941525 1.20779
C  2.654408 0.637022 1.010687
C  0.306645 1.595152 1.121966
C  -1.676267 -0.444549 -0.355182
C  2.584747 -0.035457 -0.377551
C  -2.983184 -1.137435 0.00785
C  -2.537522 1.650122 -1.496214
C  3.722396 -1.065708 -0.562219
C  -3.843737 -1.660889 -0.989859
C  -3.368917 -1.24835 1.370306
C  -5.060783 -2.287689 -0.634985
C  -4.58384 -1.874131 1.726879
C  -5.434411 -2.397453 0.724171
C  6.112896 -1.00096 -0.853288
H  -2.327673 1.39888 0.620157
H  0.278282 1.43025 -1.038803
H  -0.484349 2.881142 -0.367638
H  2.051853 2.635809 0.380503
H  2.369022 -0.082937 1.804764
H  3.713233 0.916629 1.177242
H  -1.353335 -0.736525 -1.371415
H  -0.890973 -0.753198 0.358395
H  2.68995 0.73105 -1.171773
H  1.612403 -0.546868 -0.527294
H  3.62367 -1.841337 0.234572
H  3.583074 -1.586106 -1.540232
H  3.029992 2.695677 2.740386
H  1.480497 2.189727 3.258157
H  -3.560386 -1.563984 -2.044346
H  -2.708612 -0.843537 2.148103
H  -5.715566 -2.688655 -1.417322
H  -4.866595 -1.956238 2.782791
H  -3.501609 3.277055 -2.051458
H  -6.376454 -2.885168 0.999937
H  6.979098 -2.674592 -1.806547
H  5.429908 -2.974055 -1.063804
H  8.196859 -0.763019 -0.718726
H  7.25335 0.702053 -0.770071
