program: Gaussian 09
title: 000128662
version: EM64L-G09RevD.01
frameworkgroup: C1[X(C10H8ClN3O3)]
method: RPBEPBE
basis: SDD
operation: Freq
keyword: #p
keyword: freq=noraman
keyword: PBEPBE/SDD
title: #p freq=noraman PBEPBE/SDD
converged: YES YES NO NO
title: Mulliken charges:
elementType: Cl O O O N N N C C C C C C C C C C H H H H H H H H
charge: 0.006591 -0.278925 -0.453808 -0.210364 0.018089 0.018955 -0.419969 -0.449335 0.637532 -0.362548 -0.404687 0.284820 -0.352184 -0.347308 0.190160 -0.386662 0.182175 0.257769 0.241054 0.282647 0.217846 0.362826 0.284055 0.284457 0.396814
chargesum: 0.00000
title: Mulliken charges with hydrogens summed into heavy atoms:
elementType: Cl O O O N N N C C C C C C C C C C
charge: 0.006591 -0.278925 -0.056994 -0.210364 0.018089 0.018955 -0.057143 -0.449335 0.637532 -0.104780 -0.163633 0.284820 -0.069537 -0.129461 0.190160 0.181851 0.182175
polarizability: 2.35393520e+02 -1.25701741e+01 1.54949314e+02 -2.85465535e+00 -3.20611246e+00 6.96952595e+01
1716.lowfreq: -9.0806 -0.0022 -0.0017 -0.0014 0.9187 4.5290 10.6199 27.1839 34.7515
frequency: 10.3246 27.1353 34.7407 44.9620 61.6782 71.1377 128.1667 149.3799 197.8643 220.8761 243.5642 272.3828 326.6961 359.1698 372.7939 398.0789 402.1269 433.4825 480.4714 489.6609 532.9464 541.5556 551.0727 584.6894 630.1350 648.5859 677.7984 685.7940 738.2566 772.7923 793.3574 835.4290 859.3118 876.7381 879.5780 957.9622 961.8469 978.0713 1005.5251 1012.9560 1073.7314 1078.1531 1132.4343 1160.8176 1209.8966 1211.6858 1253.8900 1259.7716 1302.2474 1314.1272 1335.0997 1363.7771 1412.0559 1425.2660 1457.1617 1480.6088 1512.3550 1555.2564 1596.1086 1619.6418 1688.6246 2990.3948 3028.4360 3128.3043 3156.7157 3159.0774 3175.9715 3532.8764 3566.1135
redmass: 8.6657 5.2286 7.8146 6.1685 6.0696 8.0411 9.1332 3.5855 9.8142 7.4669 5.9063 10.1947 9.6605 11.3441 12.6786 6.5594 2.8346 6.4110 7.7496 1.9217 4.4058 3.6253 4.1837 1.2174 6.9062 1.4627 6.6651 4.5948 5.6018 5.4690 6.1977 1.4511 6.7107 4.7754 1.6535 1.4851 7.1165 2.0340 1.4213 2.8213 3.2271 2.4344 1.3700 2.9392 1.1471 1.1455 3.1667 2.0940 2.1961 1.3871 1.6906 5.2293 3.9172 8.7450 1.0912 2.1146 2.5916 7.7048 7.9277 6.1629 9.2594 1.0609 1.0985 1.0885 1.0885 1.0948 1.0963 1.0645 1.0779
irintensity: 0.3834 0.8930 7.6828 0.1467 1.7425 1.3214 2.1760 2.3407 6.2135 2.9504 3.2301 3.2294 3.6929 0.8584 3.6656 0.5479 0.9019 4.1079 12.3973 48.1195 10.9825 35.3104 20.4888 47.9711 0.3869 178.5186 16.5100 27.5683 22.8898 2.7780 9.0919 18.8681 127.9508 40.6350 32.0898 4.7924 57.8050 0.8994 3.3760 13.9630 61.4071 157.5175 11.0394 0.6916 4.5357 4.8298 12.6026 37.3601 55.4167 5.4305 28.4189 4.3401 4.3749 66.7666 6.5503 438.5950 124.3442 58.4489 100.9476 11.9140 289.2703 25.8796 4.0140 13.2762 0.0330 5.7639 1.3786 35.2455 55.1835
temp: 298.150 k
press: 1.00000 atm
elementType: 17 8 8 8 7 7 7 6 6 6 6 6 6 6 6 6 6 1 1 1 1 1 1 1 1
symmnumber: 1
zpe: 445188.4 jmol-1
zpe.correction: 0.169563 hartree
zpe.thermalcorrener: 0.185551 hartree
zpe.thermalcorrenthalpy: 0.186495 hartree
zpe.thermalcorrgfe: 0.121754 hartree
zpe.sumelectzpe: -1234.563364 hartree
zpe.sumelectthermal: -1234.547377 hartree
zpe.sumelectthermalent: -1234.546433 hartree
zpe.sumelectthermalfe: -1234.611174 hartree
dipole: -1.0457 -3.2748 -0.5158
dipole: 3.4762
quadrupole: -122.2131 -102.6223 -107.3791
quadrupole: 18.0969 1.2484 -1.4890
quadrupole: -11.4750 8.1159 3.3591 18.0969 1.2484 -1.4890
hfenergy: -1234.7329277 hartree
pointgroup: C01 [X(C10H8Cl1N3O3)]
dipole: -0.3219516 -1.3231146 0.1272107 debye
dipolederiv: -0.4303612 -0.1921565 0.0998318 -0.257264 -0.3395483 0.126198 0.1256577 0.1237279 -0.0985855 -0.8587076 0.2111875 -0.0238196 -0.0549345 -0.9089313 0.0645519 -0.0110134 0.0775409 -0.3699936 -0.6312488 0.313631 -0.0191218 0.3759051 -0.9750843 0.0303752 -0.0331668 0.0396111 -0.4262773 -1.2221373 0.0695886 0.0402567 -0.2128699 -0.5503295 0.0313348 0.067785 0.0199134 -0.3231728 -0.120863 -0.0380823 0.0337656 -0.4793699 0.0752352 -0.0060633 -0.5711513 0.3399309 -0.1289101 -0.018607 -0.104705 0.0212988 -0.0099906 -0.1676791 0.0428756 0.7516947 -0.3292742 0.0134596 -1.2126408 -0.3004282 0.0482386 -0.5717485 -0.6862373 0.063333 0.088368 0.0740962 -0.4437462 0.5139011 0.3815978 -0.174278 0.920934 0.464878 -0.2169791 -0.3706232 -0.1796662 0.1472363 0.1285431 -0.1141873 0.0296357 -0.2714289 -0.0719279 0.0557565 0.0847532 0.0437169 0.0030578 -0.0662589 0.1474561 -0.0639284 0.1157022 -0.0471843 -0.043857 -0.0465074 -0.0468562 -0.1118222 -0.2538125 -0.0482566 0.0287524 0.0438669 0.0048528 -0.0614128 -0.0171336 -0.0546812 -0.1095951 -0.4342423 0.0706183 0.0069166 0.1787311 -0.086901 -0.0003561 0.0050425 0.0063237 -0.0032458 -0.0674057 -0.0958618 0.032132 -0.0075608 0.0705136 -0.0648926 0.0225117 -0.0431547 -0.0757945 0.0560142 0.0494744 -0.0492087 -0.0612147 -0.0092967 -0.0526645 -0.0621987 -0.0478128 -0.09971 1.8504532 0.043786 -0.035175 0.418993 1.2124759 -0.1200587 -0.0715212 -0.1585056 0.2437994 0.5721989 -0.050535 0.0001506 -0.3061785 -0.1402498 0.0571239 0.0460516 0.0580921 0.281484 1.6419483 -0.1778514 -0.0577452 0.0512429 1.3492492 -0.1114203 -0.0777087 -0.1121786 0.228468 0.0437679 -0.0670872 0.0354234 -0.0577123 0.0578527 0.0442587 0.0338783 0.0442904 0.1363096 0.0571721 0.0734675 -0.0215731 0.0528743 0.0004486 0.0555828 -0.0064668 0.0531626 0.1268541 0.136358 0.0507346 -0.0182978 0.0177508 0.0373962 0.0461375 -0.0227627 0.0351444 0.1353734 -0.0222025 -0.0910938 0.0530258 -0.1028091 0.025 0.0581112 0.0713408 0.0509235 0.1161419 0.2986628 0.0718971 -0.0058556 0.1744439 0.2076998 0.0070256 -0.0125384 0.0050033 0.3200455 -0.0486283 -0.0449276 -0.0163546 0.0535152 0.1074021 0.0387795 -0.0734629 0.0301981 0.005499 -0.0434599 -0.0383597 0.0313501 0.0621788 0.081749 -0.0614534 0.056637 -0.0509652 0.0240938 0.1315562 -0.1199063 0.0245795 -0.0730564 0.2886164 0.0177136 0.0225346 0.0214194 0.4090309 unknown
polarizability: 236.4434816|-8.3942092|147.3045274|-6.3624981|-22.1753722|76.2900845 unknown
InChI: InChI=1S/C10H8ClN3O3/c11-10(13-14-10)7-3-1-6(2-4-7)9(17)12-5-8(15)16/h1-4,12,15H,5H2
charge 0 multiplicity 1
25 atoms
Cl 5.249406 1.030046 -0.574889
O  -2.012601 2.250858 -0.177911
O  -4.108959 -2.064489 0.43919
O  -6.110267 -0.876219 0.414005
N  4.619929 -1.238545 0.993894
N  4.515008 -1.681038 -0.235302
N  -2.56253 0.031138 0.162387
C  4.057873 -0.243595 -0.01408
C  2.612546 0.091151 -0.011485
C  2.128485 1.347891 -0.45871
C  1.681135 -0.877596 0.460261
C  -0.18209 0.658389 0.01075
C  0.750416 1.624786 -0.442701
C  0.302735 -0.59327 0.469938
C  -1.638794 1.045337 -0.007199
C  -3.990393 0.342956 0.171246
C  -4.866741 -0.882205 0.351747
H  2.83304 2.10445 -0.815716
H  2.028789 -1.848876 0.82678
H  0.3636 2.593567 -0.774221
H  -0.378403 -1.354095 0.868255
H  -2.298159 -0.952634 0.225251
H  -4.293033 0.848425 -0.767495
H  -4.232879 1.063892 0.976082
H  -4.713013 -2.846623 0.550523
