program: Gaussian 09
title: 000128725
version: EM64L-G09RevD.01
frameworkgroup: C1[X(C21H30O8)]
method: RPBEPBE
basis: SDD
operation: Freq
keyword: #pfreq=noraman
keyword: PBEPBE/SDD
title: #p freq=noraman PBEPBE/SDD
converged: YES YES NO NO
title: Mulliken charges:
elementType: O O O O O O O O C C C C C C C C C C C C C C C C C C C C C H H H H H H H H H H H H H H H H H H H H H H H H H H H H H H
charge: -0.324874 -0.218621 -0.215322 -0.416969 -0.424981 -0.468255 -0.477619 -0.162545 0.386736 -0.276967 -0.266377 -0.655849 -0.125875 0.380201 -0.510217 -0.459866 -0.480160 0.217027 -0.376637 -0.771734 -0.751317 -0.761276 0.157942 -0.084525 -0.151407 -0.119624 -0.167983 -0.091120 0.148004 0.239352 0.249696 0.223525 0.228026 0.214959 0.221833 0.215036 0.212040 0.205743 0.222948 0.206642 0.276323 0.217545 0.215092 0.222990 0.211765 0.241575 0.205644 0.211088 0.215686 0.213392 0.299900 0.269982 0.222116 0.243620 0.265151 0.354328 0.360762 0.382247 0.401204
chargesum: 0.00000
title: Mulliken charges with hydrogens summed into heavy atoms:
elementType: O O O O O O O O C C C C C C C C C C C C C C C C C C C C C
charge: -0.324874 -0.218621 -0.215322 -0.062641 -0.064219 -0.086007 -0.076415 -0.162545 0.386736 -0.037615 -0.016681 -0.204297 0.089084 0.380201 -0.073349 -0.042083 -0.050570 0.217027 -0.100315 -0.116107 -0.092333 -0.121110 0.157942 0.215375 0.118575 0.102492 0.075638 0.174030 0.148004
polarizability: 2.81406530e+02 3.96316821e+00 2.38844726e+02 2.06120702e+00 5.72666468e+00 2.22583131e+02
1716.lowfreq: -9.0239 -5.3489 0.0002 0.0006 0.0008 4.9554 12.6818 16.7865 24.9860
frequency: 11.3824 15.6315 24.9096 38.6849 44.2240 57.4830 65.7342 85.8921 95.4860 111.4624 117.5827 133.7757 168.5552 175.7298 194.4535 196.8838 207.1151 214.1155 223.1234 240.9041 244.0213 255.0840 264.7428 275.2882 282.9621 291.0055 300.5723 325.5016 333.4159 342.8815 362.9385 366.1323 375.4482 394.3092 401.0661 409.9157 420.7590 455.5305 456.5408 474.2270 493.5511 506.6604 525.8432 530.5138 533.4621 537.2453 563.4935 575.7398 582.5474 618.9828 638.7347 649.8763 674.0099 683.6542 712.7788 738.5060 749.6081 786.5310 820.6950 835.5565 841.1513 854.4551 886.3801 893.6111 899.1560 902.6270 908.9423 913.4393 928.1204 932.1561 937.8354 952.0493 960.4935 972.4689 976.3048 987.4803 997.3611 1010.5665 1015.5792 1021.8330 1033.9283 1039.3862 1044.1524 1055.9421 1063.7267 1065.7356 1069.4343 1081.6150 1095.2400 1112.1715 1114.5803 1132.4619 1150.1506 1156.9800 1170.7755 1178.2010 1184.6352 1197.2879 1217.4526 1220.7861 1226.2820 1229.6333 1236.7644 1253.3518 1257.9282 1261.6769 1268.9982 1273.6908 1273.9699 1278.3802 1287.0032 1295.0394 1296.8209 1302.7506 1305.7830 1314.0780 1316.9016 1319.4104 1323.6976 1330.3440 1342.9115 1344.3553 1373.9088 1378.1662 1386.0608 1388.7297 1392.5121 1407.8380 1459.3530 1463.6338 1465.6112 1467.9390 1473.2568 1478.2117 1481.0882 1482.1205 1485.0336 1488.6478 1620.6140 1639.1430 1706.6918 2935.5616 2952.0100 2961.1816 2963.6812 2970.5415 2970.9393 2973.3252 2979.4494 2981.3978 2984.6354 2989.2751 2989.8431 2993.4459 3040.2797 3048.6027 3048.8432 3057.1765 3060.0350 3060.7787 3062.6236 3063.4199 3069.1038 3074.6725 3091.4267 3104.9954 3147.5498 3485.6065 3521.3138 3530.8025 3533.4101
redmass: 4.7193 5.7828 9.3280 6.2142 5.3330 5.5162 6.5923 3.7583 7.0200 3.1258 4.3179 3.6466 3.1343 6.4116 3.2292 2.2306 1.5629 1.9196 1.7094 5.1394 1.4567 2.4753 1.6613 4.3616 2.2525 5.3386 3.7996 2.6448 2.2772 3.9577 3.4761 3.3257 2.6874 2.7021 2.5322 2.5227 3.1114 3.1226 1.2709 3.4398 3.1142 5.0154 3.4764 1.2136 2.7832 3.5522 4.5044 3.1967 2.6014 1.9965 3.7382 3.3129 6.3959 3.7848 6.5303 3.5010 5.1420 3.5470 2.0373 3.8280 2.2656 3.0671 5.3550 1.7013 2.0908 2.4267 1.9774 2.8771 3.8554 2.0084 1.8008 1.4450 1.9216 2.3862 2.8040 1.8290 2.8919 3.5951 1.5563 4.2585 2.4684 2.2921 2.4875 2.5389 2.8743 3.4840 2.5098 3.0265 2.1476 2.1726 1.9510 1.5878 2.0086 1.6913 1.4947 1.2356 1.7582 1.8263 2.3405 1.3286 1.8431 1.2557 2.2130 1.4521 1.5323 1.4401 1.5776 1.4492 1.4358 1.3395 1.4000 1.6388 1.6238 1.5562 1.3314 1.2693 1.3359 1.5042 1.2765 2.0269 1.5588 1.3003 1.2095 1.2146 1.2186 1.6802 1.2051 1.4697 1.0663 1.0696 1.0537 1.0868 1.0555 1.0928 1.0619 1.0576 1.0604 1.0563 8.0775 12.4166 9.7905 1.0825 1.0817 1.0804 1.0355 1.0371 1.0800 1.0378 1.0612 1.0644 1.0617 1.0823 1.0852 1.0638 1.1028 1.0987 1.1031 1.0997 1.1031 1.0986 1.0989 1.0991 1.0992 1.0858 1.0971 1.0882 1.0952 1.0653 1.0642 1.0653 1.0652
irintensity: 0.4280 0.2013 1.8807 1.4715 0.2511 1.5575 1.8135 0.2096 0.5199 0.4213 0.3280 0.4288 0.6285 3.1701 4.0495 0.8555 0.9856 1.9842 0.5911 4.0616 1.3889 8.9109 1.1350 6.2416 3.3280 1.3554 6.6206 30.7637 0.1681 7.7486 56.3801 19.1929 6.8965 1.6090 5.6521 0.8570 20.1741 3.2084 152.7202 6.0316 12.6385 32.6462 20.8567 86.2501 41.9335 26.0200 52.2293 5.7991 40.9573 169.8979 9.9695 0.5213 2.7405 14.5354 23.3530 4.0653 27.1621 9.7069 6.4873 62.4007 108.9909 48.0046 16.9486 14.5722 56.0395 162.9535 8.0437 33.6983 69.6759 0.7823 13.6822 0.9003 47.2235 19.2338 284.9232 40.1281 38.3856 130.4599 3.2551 115.7302 23.5811 65.3826 37.5363 17.9203 11.5734 12.8263 82.4682 44.5659 4.8107 90.1621 3.5598 20.8804 10.2126 4.4993 3.5298 23.2323 6.6988 12.5415 35.4942 18.5422 78.2435 8.7330 6.2544 14.9567 13.1686 16.0241 2.7279 10.6538 16.5350 6.8104 0.3940 28.0551 7.9809 4.8014 14.3521 17.2620 2.9816 6.5787 2.0726 7.8609 0.5014 29.0450 14.9489 27.4653 14.0049 5.3977 11.8178 19.1824 4.9004 4.1474 8.5149 7.2042 4.7701 6.0531 2.3687 13.3954 12.3867 8.3348 102.8276 228.9280 225.9992 14.8927 39.0976 15.1091 37.2040 29.2864 7.3030 40.8200 55.0241 6.9283 61.1297 24.1454 53.4626 47.0317 9.9395 31.8340 15.7722 0.6128 18.4951 31.3244 87.9450 61.2653 56.0404 14.6098 32.8037 7.2120 3.5080 95.1121 33.4632 19.7790 21.0622
temp: 298.150 k
press: 1.00000 atm
elementType: 8 8 8 8 8 8 8 8 6 6 6 6 6 6 6 6 6 6 6 6 6 6 6 6 6 6 6 6 6 1 1 1 1 1 1 1 1 1 1 1 1 1 1 1 1 1 1 1 1 1 1 1 1 1 1 1 1 1 1
symmnumber: 1
zpe: 1270520.1 jmol-1
zpe.correction: 0.483916 hartree
zpe.thermalcorrener: 0.512928 hartree
zpe.thermalcorrenthalpy: 0.513872 hartree
zpe.thermalcorrgfe: 0.423112 hartree
zpe.sumelectzpe: -1417.758755 hartree
zpe.sumelectthermal: -1417.729743 hartree
zpe.sumelectthermalent: -1417.728799 hartree
zpe.sumelectthermalfe: -1417.819559 hartree
dipole: 3.4885 3.3190 -4.5415
dipole: 6.6190
quadrupole: -157.3169 -179.0288 -183.5526
quadrupole: -17.7456 14.1249 -9.2893
quadrupole: 15.9826 -5.7294 -10.2532 -17.7456 14.1249 -9.2893
hfenergy: -1418.2426709 hartree
pointgroup: C01 [X(C21H30O8)]
dipole: 1.4094427 1.1935598 -1.835817 debye
polarizability: 280.8318157|5.3932385|240.0514807|4.0350739|4.5244884|221.9510908 unknown
InChI: InChI=1S/C21H30O8/c1-9-4-5-12-11(6-10-7-20(2,3)8-21(9,10)12)18(27)29-19-15(24)13(22)14(23)16(28-19)17(25)26/h6,9-10,12-16,19,22-25H,4-5,7-8H2,1-3H3
charge 0 multiplicity 1
59 atoms
O  -1.086603 -0.584509 0.89759
O  -0.466092 0.051876 3.073897
O  -3.18668 0.58208 1.031068
O  -2.329057 -3.078432 0.881331
O  -3.942251 -2.657902 -1.574749
O  -3.803266 -0.055626 -2.651577
O  -4.299548 2.494603 -1.858266
O  -4.15326 3.072307 0.389394
C  3.170826 -0.341969 -0.158126
C  3.567891 0.351481 1.206817
C  1.595596 -0.558613 -0.100934
C  3.625162 0.664606 -1.255855
C  3.730121 -1.804532 -0.300198
C  3.675161 2.086322 -0.604183
C  4.142104 1.766691 0.852747
C  1.3254 -2.06158 -0.45348
C  2.639108 -2.543429 -1.11369
C  1.219768 -0.130096 1.310657
C  2.289383 0.355845 2.01003
C  5.159329 -1.961852 -0.849187
C  2.288797 2.786185 -0.606139
C  4.6906 3.00001 -1.33326
C  -0.133973 -0.190127 1.893231
C  -2.508758 -0.664186 1.322979
C  -3.09984 -1.882264 0.570575
C  -3.193583 -1.582254 -0.936139
C  -3.903851 -0.23746 -1.202655
C  -3.211915 0.904456 -0.40502
C  -3.91944 2.253583 -0.50863
H  4.344521 -0.224548 1.751555
H  1.082299 0.080978 -0.844048
H  4.648435 0.41234 -1.593335
H  2.97559 0.642236 -2.151334
H  3.712703 -2.24095 0.723555
H  3.824405 2.546634 1.569278
H  5.248137 1.725636 0.880716
H  0.443908 -2.181785 -1.10812
H  1.143278 -2.644458 0.471262
H  2.755665 -3.642259 -1.084765
H  2.68235 -2.229308 -2.175876
H  2.224425 0.714414 3.044008
H  5.224626 -1.676373 -1.915268
H  5.88685 -1.345618 -0.286759
H  5.486155 -3.015289 -0.76997
H  2.365106 3.789645 -0.145817
H  1.531645 2.220138 -0.038311
H  1.91934 2.918856 -1.640878
H  5.696083 2.538881 -1.361657
H  4.779861 3.97979 -0.826744
H  4.375159 3.190478 -2.376857
H  -2.557658 -0.770285 2.417208
H  -4.110295 -2.08859 0.961624
H  -2.169908 -1.503706 -1.367139
H  -4.964156 -0.316343 -0.880911
H  -2.177242 1.022128 -0.793942
H  -1.403586 -2.945284 0.545804
H  -4.067895 -2.393273 -2.524041
H  -4.175392 0.83996 -2.875713
H  -4.735839 3.386538 -1.92405
