program: Gaussian 09
title: 000128687
version: EM64L-G09RevD.01
frameworkgroup: C1[X(C24H32O3)]
method: RPBEPBE
basis: SDD
operation: Freq
keyword: #pfreq=noraman
keyword: PBEPBE/SDD
title: #p freq=noraman PBEPBE/SDD
converged: YES YES NO NO
title: Mulliken charges:
elementType: O O O C C C C C C C C C C C C C C C C C C C C C C C C H H H H H H H H H H H H H H H H H H H H H H H H H H H H H H H H
charge: -0.223271 -0.237686 -0.214469 -0.111898 0.387954 -0.148799 -0.097299 0.233632 -0.526495 -0.259612 -0.529207 -0.563148 -0.483032 -0.474161 0.540797 -0.834862 -0.641594 -0.493002 -0.812299 0.055139 -0.563370 -0.587370 0.178153 -0.170435 0.150224 -0.221176 -0.661638 0.213009 0.229405 0.200007 0.199796 0.225454 0.260176 0.219359 0.223783 0.211101 0.231843 0.227824 0.216840 0.263902 0.211680 0.248959 0.228844 0.222223 0.221774 0.234694 0.218334 0.214148 0.221877 0.228504 0.233647 0.244302 0.230815 0.254996 0.235112 0.236684 0.220916 0.239945 0.238970
chargesum: 0.00000
title: Mulliken charges with hydrogens summed into heavy atoms:
elementType: O O O C C C C C C C C C C C C C C C C C C C C C C C C
charge: -0.223271 -0.237686 -0.214469 0.101111 0.387954 0.080606 0.102708 0.233632 -0.101245 0.000564 -0.086065 -0.120204 -0.038367 0.001421 0.540797 -0.134836 -0.185126 -0.060520 -0.128271 0.055139 -0.088253 -0.332374 0.178153 -0.170435 0.150224 0.250620 0.038193
polarizability: 3.38992943e+02 7.01789614e+00 2.84258043e+02 1.42068337e+01 -5.46197950e+00 1.90592137e+02
1716.lowfreq: -13.0798 -6.4153 -0.0032 -0.0013 -0.0008 3.7852 16.5997 18.9431 31.3218
frequency: 15.9663 18.6865 31.3064 44.4562 48.1503 55.4986 67.3651 90.3521 105.6735 117.1875 145.5802 149.0971 163.9352 174.1170 195.3882 198.9244 204.5709 218.4385 226.1818 235.3429 252.4556 263.0165 270.7503 280.1447 292.2842 306.9350 317.6686 351.7454 366.5440 387.5496 400.3570 417.6658 427.7383 438.3996 449.8221 464.5375 469.8904 498.6445 507.9390 526.5212 530.8652 554.3344 566.1777 601.0788 632.4831 646.2892 669.8040 684.5666 732.8081 740.2019 745.0453 773.8555 802.2325 803.0978 807.7084 830.8420 839.8827 854.2804 871.6146 884.4405 903.2911 913.9487 924.8393 936.2717 952.2012 956.4455 969.2448 992.5157 998.5829 1002.7047 1008.3109 1024.1948 1028.0802 1031.3751 1046.0463 1059.3484 1074.2970 1079.3988 1093.8209 1113.5337 1114.8844 1116.0576 1120.6675 1123.6841 1126.2533 1135.3354 1158.2893 1174.6346 1183.1036 1186.0901 1197.0359 1202.3607 1211.8416 1229.9153 1234.4168 1241.1534 1247.6733 1251.6843 1265.5128 1268.9844 1278.2790 1280.5224 1288.3170 1297.8078 1304.0274 1320.6990 1323.4420 1327.0445 1331.5899 1337.0647 1337.4207 1344.6540 1349.1950 1352.7009 1353.1261 1361.6750 1370.5833 1391.0545 1398.0101 1403.5688 1439.8069 1453.8231 1457.2355 1459.5535 1463.8922 1467.5348 1469.5897 1471.0252 1473.3426 1478.2672 1481.8230 1482.3985 1485.5412 1491.5883 1492.8854 1545.4698 1583.6874 1622.5322 2253.9656 2906.9897 2912.7978 2952.3440 2959.5285 2963.0643 2972.5910 2973.3751 2977.4077 2985.2947 2986.3226 2988.4133 2990.3864 2992.3658 3001.9111 3012.3607 3014.5824 3027.8313 3035.8108 3039.7915 3041.5784 3048.0507 3050.4655 3060.5752 3073.8850 3076.3514 3078.8455 3081.1496 3082.4273 3089.5876 3098.3784 3116.9176 3117.3194
redmass: 4.0436 4.7299 5.4830 3.0243 2.8248 2.8636 5.0911 4.6557 3.4156 3.9668 2.0329 5.8490 2.0543 3.2108 2.0456 1.6620 2.6765 2.1744 2.3887 1.1640 2.1924 2.6241 3.1677 2.6314 2.7535 3.5705 3.0289 2.5861 3.1163 2.7217 4.2641 3.3466 3.8038 8.8399 3.4532 3.9570 4.4983 3.6091 2.9376 2.8425 2.5977 2.8860 3.8811 5.0527 3.6671 3.8504 3.3186 3.1761 3.3365 3.2917 3.0355 2.1723 2.6186 1.0908 2.3060 1.9749 2.1926 2.1533 2.4374 1.5445 1.9233 1.9794 1.7683 1.9931 2.0974 2.0042 2.3321 2.1605 2.0373 2.9053 2.4807 1.8667 2.0111 1.8458 2.1197 2.7860 2.3769 2.7738 1.6632 2.0631 2.2733 2.1494 1.3761 1.8846 1.9823 1.6690 2.4342 1.3991 1.8441 1.8633 2.2114 1.5216 1.2039 1.3508 1.7001 1.4863 1.1703 1.4506 1.5676 1.5699 1.8170 1.5746 1.3962 1.7060 1.3751 1.4938 1.5054 1.4411 1.4587 1.5676 1.4535 2.1198 1.4138 1.4541 1.4035 1.5362 1.5523 1.2099 1.2068 1.2525 1.0790 1.0871 1.0798 1.0382 1.0864 1.0826 1.0874 1.0812 1.0730 1.0825 1.0549 1.0623 1.0574 1.0681 1.0825 7.7779 10.0108 7.7203 11.9053 1.0812 1.0806 1.0661 1.0629 1.0737 1.0676 1.0684 1.0608 1.0473 1.0574 1.0589 1.0617 1.0531 1.0362 1.0573 1.0640 1.0964 1.0955 1.0994 1.1000 1.1002 1.0994 1.0952 1.0978 1.0989 1.1029 1.1088 1.0990 1.0987 1.0982 1.0911 1.1036
irintensity: 0.8669 0.7189 2.5227 0.7809 3.6917 2.2417 2.0086 2.6472 2.6087 0.6935 0.1828 1.7205 1.7070 0.7335 0.0741 0.1818 0.4549 0.3327 0.1670 0.3529 0.9661 1.1207 2.8726 1.4530 0.1318 5.1508 2.7327 0.1652 2.3701 1.0703 1.1512 0.4314 0.4602 4.3583 3.6091 4.1342 8.6064 1.3906 5.3829 0.3057 0.3086 7.7797 2.9161 1.2859 5.9237 0.8718 2.5590 5.8729 0.6892 8.0881 8.2042 4.3981 41.7440 4.6427 8.6754 5.4614 0.1168 38.6755 79.6240 42.7821 22.4912 2.7989 2.5831 11.1840 19.7563 11.3482 7.5833 0.7512 65.2639 94.7900 77.4355 2.3529 2.8620 0.7898 43.8169 117.6011 3.7523 21.3763 13.8406 20.6847 2.8909 8.1343 7.1070 2.6542 2.5770 3.7810 2.7995 4.5905 7.3731 26.1711 13.0431 22.9607 17.1067 14.8583 8.8236 31.2798 0.0110 2.8402 14.5837 3.5618 26.1813 11.6989 0.7046 1.3397 1.0781 0.7040 15.0310 6.1807 2.7309 4.4208 6.7658 8.3333 0.4314 8.7596 1.1977 36.3664 20.5913 14.4494 31.3680 42.7584 18.2446 20.2616 3.4230 13.5468 9.2178 9.0092 6.8225 9.2310 7.7688 6.9488 6.9537 10.5315 4.3446 15.3855 5.7153 135.8402 163.0947 210.1191 689.8598 4.7032 21.2541 16.0293 28.8165 8.9990 25.6080 13.9561 46.3098 25.9426 1.4220 7.5172 39.7045 47.9737 12.1648 23.6085 33.7017 29.3638 41.7568 4.0151 89.2564 28.9003 30.7440 23.4170 37.8100 36.1999 36.6209 7.1797 25.9708 21.1585 21.1574 11.1699 35.5132
temp: 298.150 k
press: 1.00000 atm
elementType: 8 8 8 6 6 6 6 6 6 6 6 6 6 6 6 6 6 6 6 6 6 6 6 6 6 6 6 1 1 1 1 1 1 1 1 1 1 1 1 1 1 1 1 1 1 1 1 1 1 1 1 1 1 1 1 1 1 1 1
symmnumber: 1
zpe: 1323069.3 jmol-1
zpe.correction: 0.503930 hartree
zpe.thermalcorrener: 0.530955 hartree
zpe.thermalcorrenthalpy: 0.531899 hartree
zpe.thermalcorrgfe: 0.445391 hartree
zpe.sumelectzpe: -1157.290507 hartree
zpe.sumelectthermal: -1157.263483 hartree
zpe.sumelectthermalent: -1157.262538 hartree
zpe.sumelectthermalfe: -1157.349046 hartree
dipole: 5.9448 1.5270 1.2630
dipole: 6.2663
quadrupole: -179.6253 -163.3900 -163.0251
quadrupole: 46.9145 -15.2244 10.5471
quadrupole: -10.9452 5.2901 5.6551 46.9145 -15.2244 10.5471
hfenergy: -1157.7944374 hartree
pointgroup: C01 [X(C24H32O3)]
dipole: 2.3241765 -0.6369922 -0.5200775 debye
polarizability: 338.4774446|-7.9013184|284.5291735|-15.6702304|-4.8822531|190.8365039 unknown
InChI: InChI=1S/C24H32O3/c1-4-27-14-11-22(26)21-8-7-19-18-6-5-16-15-17(25)9-12-23(16,2)20(18)10-13-24(19,21)3/h15,18-21H,4-10,12-13H2,1-3H3
charge 0 multiplicity 1
59 atoms
O  4.307536 2.270553 -0.831917
O  -6.68411 -2.183454 1.11357
O  5.529122 -2.155416 0.504054
C  0.009516 1.724905 0.465367
C  1.186607 0.977709 -0.242126
C  -1.378458 1.37913 -0.113953
C  -1.602436 -0.164086 0.000476
C  -3.016606 -0.643254 -0.532907
C  0.964381 -0.54105 -0.057061
C  2.399609 1.595529 0.566862
C  -0.420811 -0.970981 -0.611711
C  0.472895 3.200473 0.50937
C  -2.503731 2.135194 0.626504
C  2.018029 3.101622 0.745957
C  -4.112207 0.224389 0.114269
C  1.320595 1.339322 -1.745876
C  -3.900358 1.726699 0.10003
C  -3.218963 -2.138615 -0.13337
C  -3.130365 -0.49182 -2.084382
C  3.758853 1.383846 -0.103231
C  -4.680025 -2.624698 -0.227513
C  -5.258695 -0.30613 0.651853
C  -5.622413 -1.734506 0.58035
C  4.385012 0.098339 0.106918
C  4.963271 -0.983506 0.281767
C  6.873936 -2.402964 -0.172944
C  7.306647 -3.802135 0.233856
H  0.008621 1.356077 1.518516
H  -1.408411 1.681009 -1.182414
H  -1.606393 -0.383128 1.094587
H  1.018367 -0.787877 1.024426
H  1.760417 -1.124205 -0.559105
H  2.422604 1.080524 1.548407
H  -0.41868 -0.859551 -1.712658
H  -0.558721 -2.048723 -0.406114
H  -0.029133 3.776154 1.306927
H  0.250545 3.708289 -0.448892
H  -2.37296 3.22754 0.508958
H  -2.438102 1.915041 1.712182
H  2.58624 3.714803 0.025648
H  2.294779 3.447666 1.757784
H  1.587327 2.40001 -1.891665
H  2.121072 0.737834 -2.214592
H  0.388932 1.14427 -2.303939
H  -3.993705 2.088647 -0.946513
H  -4.699348 2.225911 0.678118
H  -2.872064 -2.271743 0.911689
H  -2.581688 -2.78084 -0.768603
H  -2.935922 0.542786 -2.417508
H  -2.409862 -1.153669 -2.596565
H  -4.143132 -0.76438 -2.431235
H  -4.784301 -3.665336 0.127463
H  -5.028691 -2.614534 -1.280884
H  -5.999451 0.347087 1.131962
H  6.713156 -2.299192 -1.260948
H  7.564214 -1.616694 0.181233
H  8.281462 -4.038054 -0.230358
H  7.415575 -3.877783 1.32862
H  6.571924 -4.554034 -0.099339
