program: Gaussian 09
title: 000128785
version: EM64L-G09RevD.01
frameworkgroup: C1[X(C26H20O10)]
method: RPBEPBE
basis: SDD
operation: Freq
keyword: #p
keyword: freq=noraman
keyword: PBEPBE/SDD
title: #p freq=noraman PBEPBE/SDD
converged: YES YES NO NO
title: Mulliken charges:
elementType: O O O O O O O O O O C C C C C C C C C C C C C C C C C C C C C C C C C C H H H H H H H H H H H H H H H H H H H H
charge: -0.223739 -0.223745 -0.169206 -0.169189 -0.274596 -0.274561 -0.253590 -0.253548 -0.289941 -0.289961 -0.308766 -0.308806 -0.293347 -0.293340 0.357193 0.357265 0.127984 0.127986 -0.050179 -0.050126 -0.002994 -0.003133 0.256818 0.256764 0.076917 0.076957 0.043522 0.043516 -0.377856 -0.377837 -0.176353 -0.176356 -0.495218 -0.495263 -0.522999 -0.523016 0.309411 0.309395 0.308456 0.308455 0.284850 0.284854 0.265753 0.265757 0.253676 0.210373 0.231325 0.210327 0.231332 0.253709 0.264411 0.215367 0.232756 0.264413 0.215349 0.232773
chargesum: 0.00000
title: Mulliken charges with hydrogens summed into heavy atoms:
elementType: O O O O O O O O O O C C C C C C C C C C C C C C C C C C C C C C C C C C
charge: -0.223739 -0.223745 -0.169206 -0.169189 -0.274596 -0.274561 -0.253590 -0.253548 -0.289941 -0.289961 0.000645 0.000588 0.015109 0.015115 0.357193 0.357265 0.127984 0.127986 -0.050179 -0.050126 -0.002994 -0.003133 0.256818 0.256764 0.076917 0.076957 0.043522 0.043516 -0.093006 -0.092983 0.089400 0.089402 0.200157 0.200105 0.189534 0.189519
polarizability: 4.20040611e+02 -3.31718165e-03 3.59372995e+02 5.64706203e+01 4.35433831e-03 2.14008957e+02
1716.lowfreq: -7.1963 -4.9560 -0.0009 -0.0004 -0.0003 3.5267 16.9826 22.6602 23.9524
frequency: 16.6285 22.6575 23.9113 27.3108 33.0158 46.1592 54.5418 66.1864 66.7872 94.4844 100.4758 101.3870 107.3933 137.8853 141.5350 153.6877 167.9911 180.1122 180.9772 183.7258 196.6294 202.1956 209.8872 218.0696 221.3054 222.9591 223.0997 248.4038 252.6571 297.4478 307.2707 322.0604 325.5307 349.4752 361.3681 367.1377 374.4597 406.1424 406.2220 443.5118 458.0478 459.4259 466.0436 476.4605 506.5504 530.2467 537.9896 555.7287 560.1128 573.2730 584.8676 608.4046 622.3196 646.8494 650.6318 666.8158 674.2667 675.8153 687.2575 742.1609 743.6835 747.4546 774.1461 781.9893 800.2908 810.9887 815.2052 838.3424 851.9740 852.2586 875.6901 875.7679 877.7391 880.7857 912.9959 927.0482 935.3259 937.8028 971.9080 973.7272 981.2713 983.3996 988.0438 997.6591 1033.1416 1037.8907 1076.4966 1083.6719 1091.0504 1107.4629 1108.3860 1113.0790 1113.1501 1114.6754 1114.7199 1123.2637 1124.4728 1133.4957 1149.0133 1153.0870 1154.9916 1161.0454 1161.5052 1179.2855 1196.9229 1202.9037 1219.1740 1226.6331 1257.7530 1296.4365 1301.0429 1302.1222 1305.5788 1328.7592 1345.3256 1348.5371 1391.1674 1393.5790 1412.8195 1415.2128 1436.1173 1436.4868 1444.4302 1444.5842 1453.5210 1454.0923 1458.0947 1458.2329 1464.7360 1465.5148 1468.0227 1469.0327 1478.2752 1478.3763 1526.4367 1526.7053 1596.6509 1597.3041 1631.6322 1632.3839 1670.7398 1678.3855 2977.7960 2977.9167 2986.8131 2987.0439 3040.5347 3044.0076 3051.9448 3059.1216 3086.8502 3086.8637 3097.8154 3097.9786 3129.4478 3129.4677 3132.9016 3132.9908 3237.1784 3237.1871 3271.8563 3271.8599
redmass: 2.9866 5.8277 5.4899 5.0323 3.1347 8.5394 3.8408 2.2891 2.7339 6.0777 6.1742 5.9021 4.6078 2.2612 2.0623 5.2558 3.1430 2.1104 2.6606 1.9091 1.4061 5.6124 3.0168 3.5349 6.7031 5.5159 4.3047 3.9434 4.9084 4.7011 5.1757 5.4008 4.5465 5.8772 6.2858 8.4039 7.6868 8.2709 7.5711 6.3655 8.9033 7.2592 7.3639 8.0561 8.3249 7.3934 7.5195 4.6082 4.5396 6.1057 8.4508 6.0102 8.3053 6.6146 8.5825 7.0149 9.6268 5.6944 5.9544 1.4624 1.5538 4.3837 7.8228 4.5789 5.7691 6.7793 5.2830 5.9374 7.1916 7.0531 1.3684 1.3780 8.2658 8.1973 7.1751 5.6702 2.0640 4.6401 3.7942 3.6679 3.9129 4.3861 6.9010 5.4458 5.8865 5.9079 3.1268 2.6811 4.7040 1.6876 1.4889 1.9134 2.2328 1.2481 1.2533 1.7282 1.6975 2.5041 1.8157 1.4870 1.5825 1.4956 1.5514 1.8953 1.3856 1.5778 2.5119 2.1003 1.4517 1.7761 1.8575 1.9130 2.2842 2.0087 8.2677 6.7842 3.6312 3.5619 6.5673 5.0970 1.3956 1.3278 1.4705 1.4361 1.1442 1.1608 1.0546 1.0543 2.3943 2.7104 1.1499 1.0873 1.0699 1.0702 5.9285 5.9484 9.9296 9.9456 11.1825 11.2926 12.9109 12.8584 1.0339 1.0339 1.0333 1.0333 1.0853 1.0841 1.0872 1.0861 1.0990 1.0990 1.0985 1.0986 1.1044 1.1044 1.1057 1.1057 1.0919 1.0919 1.1085 1.1085
irintensity: 3.8726 1.5027 2.4190 0.0010 0.1217 0.0359 2.4389 6.9333 3.0925 1.9732 6.7956 0.1408 3.3716 0.7199 0.5678 4.4882 4.9293 1.0360 2.0745 3.3083 0.0309 1.8224 2.4216 2.4537 1.1618 0.0180 3.7305 6.4365 5.6018 8.6112 0.0022 0.7501 3.7852 5.7581 18.2736 2.4618 5.7986 0.1503 2.8002 1.5613 16.2915 21.8041 0.3436 0.1208 0.2306 8.2629 10.4861 0.8518 4.5000 0.1663 8.7908 20.1371 2.9838 0.9458 8.3500 0.4318 1.4759 4.0381 0.0097 12.8719 95.4592 42.1652 13.6443 3.7053 5.0459 3.4313 3.2445 6.5781 6.9881 8.6712 2.1800 13.7303 38.7569 4.7364 4.5913 0.1367 25.2664 33.5501 3.1974 43.4919 0.0153 1.0299 101.2336 272.8717 117.7223 186.9868 73.3373 124.9988 253.8594 51.6066 7.0376 113.6195 64.7024 9.1409 7.2534 58.2730 40.4632 91.7942 97.5911 56.5711 3.3148 8.9739 21.1494 12.1612 0.9838 13.4829 29.1802 5.9028 7.9024 38.4219 74.5595 3.8814 82.8960 27.0848 47.1840 154.9572 97.3028 42.3140 0.2271 0.6286 1.9423 0.7300 15.0631 3.2402 44.6462 12.9991 4.5051 21.6895 129.3943 264.5050 14.5719 12.0374 1.6842 23.2079 3.5636 2.3909 14.5882 6.8944 37.4055 73.5897 104.0808 562.0211 121.0459 32.5410 108.5115 36.8084 0.1918 12.8237 7.2098 8.7927 29.5328 27.4298 48.6062 17.0836 8.6009 20.6311 15.1378 12.3771 2.8159 2.7898 0.0259 0.0149
temp: 298.150 k
press: 1.00000 atm
elementType: 8 8 8 8 8 8 8 8 8 8 6 6 6 6 6 6 6 6 6 6 6 6 6 6 6 6 6 6 6 6 6 6 6 6 6 6 1 1 1 1 1 1 1 1 1 1 1 1 1 1 1 1 1 1 1 1
symmnumber: 1
zpe: 1072252.6 jmol-1
zpe.correction: 0.408399 hartree
zpe.thermalcorrener: 0.440567 hartree
zpe.thermalcorrenthalpy: 0.441511 hartree
zpe.thermalcorrgfe: 0.342565 hartree
zpe.sumelectzpe: -1752.326523 hartree
zpe.sumelectthermal: -1752.294356 hartree
zpe.sumelectthermalent: -1752.293411 hartree
zpe.sumelectthermalfe: -1752.392357 hartree
dipole: -0.0010 -8.3479 0.0015
dipole: 8.3479
quadrupole: -172.7005 -228.1308 -191.9046
quadrupole: -0.0030 -11.5189 -0.0038
quadrupole: 24.8781 -30.5521 5.6740 -0.0030 -11.5189 -0.0038
hfenergy: -1752.7349221 hartree
pointgroup: C01 [X(C26H20O10)]
dipole: -0.0019959 -3.284319 0.002172 debye
polarizability: 422.8529877|0.0005624|359.3728469|51.0056571|-0.1670823|211.1967292 unknown
InChI: InChI=1S/C26H20O10/c1-29-21-15-11-12-14(13(11)25(27)35-17(15)9-5-7-33-19(9)23(21)31-3)26(28)36-18-10-6-8-34-20(10)24(32-4)22(30-2)16(12)18/h5-8,11-14H,1-4H3
charge 0 multiplicity 1
56 atoms
O  -2.895544 2.457213 -0.762302
O  2.899521 2.454368 0.757505
O  -1.875617 4.453246 -1.169935
O  1.882439 4.452538 1.161767
O  -0.661445 -1.162582 1.566717
O  0.660218 -1.166596 -1.564991
O  -5.367206 -1.506456 -0.119389
O  5.36532 -1.514103 0.121701
O  -3.020879 -2.887219 1.22525
O  3.016878 -2.89383 -1.220324
C  -0.539722 1.405256 0.585943
C  0.542145 1.403478 -0.588888
C  -0.694282 2.948751 0.364798
C  0.698922 2.947126 -0.370389
C  -1.788152 0.58875 0.451821
C  1.789409 0.585422 -0.453362
C  -1.821309 3.366308 -0.572002
C  1.826579 3.364692 0.565642
C  -2.900864 1.149685 -0.194303
C  2.902934 1.145845 0.191813
C  -1.856739 -0.745606 0.975628
C  1.856071 -0.749958 -0.974773
C  -4.091659 0.408845 -0.344289
C  4.092641 0.403502 0.343135
C  -3.033625 -1.539116 0.828914
C  3.031718 -1.544966 -0.826586
C  -4.11595 -0.914631 0.166751
C  4.114987 -0.920914 -0.165548
C  -5.381878 0.646927 -0.964854
C  5.38324 0.640805 0.963216
C  -6.112914 -0.509569 -0.813414
C  6.112468 -0.51713 0.814065
C  -0.628012 -2.25653 2.555722
C  0.626152 -2.261427 -2.553018
C  -4.223955 -3.393303 1.923544
C  4.218653 -3.402669 -1.918922
H  -0.031625 1.185892 1.539639
H  0.033731 1.183218 -1.542211
H  -0.749584 3.589044 1.261859
H  0.755104 3.585803 -1.268547
H  -5.701958 1.561424 -1.457771
H  5.704711 1.555727 1.454434
H  -7.113492 -0.813428 -1.107338
H  7.112545 -0.821994 1.108653
H  -0.805141 -3.229249 2.073583
H  -1.378041 -2.09417 3.352077
H  0.388038 -2.204564 2.976836
H  1.376732 -2.100541 -3.349168
H  -0.389634 -2.208892 -2.974699
H  0.802121 -3.233856 -2.069844
H  -5.103056 -3.373609 1.259064
H  -4.426591 -2.794026 2.831996
H  -3.975655 -4.42885 2.200705
H  5.098554 -3.382348 -1.255513
H  4.420759 -2.805628 -2.828963
H  3.96904 -4.438604 -2.193436
