program: Gaussian 09
title: 000127305
version: EM64L-G09RevD.01
frameworkgroup: C1[X(C12H7F9INO)]
method: RPBEPBE
basis: SDD
operation: Freq
keyword: #p
keyword: freq=noraman
keyword: PBEPBE/SDD
title: #p freq=noraman PBEPBE/SDD
converged: YES YES NO NO
title: Mulliken charges:
elementType: I F F F F F F F F F O N C C C C C C C C C C C C H H H H H H H
charge: 0.053365 -0.135941 -0.123163 -0.124482 -0.121848 -0.120396 -0.143389 -0.129880 -0.115640 -0.132492 -0.233170 -0.421538 -0.266613 0.440107 0.384823 0.389111 0.344061 -0.270002 -0.359112 -0.490206 -0.376456 0.500185 0.275786 -0.842090 0.269164 0.254760 0.237930 0.312818 0.301349 0.321315 0.321645
chargesum: 0.00000
title: Mulliken charges with hydrogens summed into heavy atoms:
elementType: I F F F F F F F F F O N C C C C C C C C C C C C
charge: 0.053365 -0.135941 -0.123163 -0.124482 -0.121848 -0.120396 -0.143389 -0.129880 -0.115640 -0.132492 -0.233170 -0.120189 -0.266613 0.440107 0.384823 0.389111 0.344061 -0.000838 -0.104351 -0.252276 -0.063638 0.500185 0.275786 -0.199131
polarizability: 2.62720271e+02 -4.14794202e+00 1.72208841e+02 6.35472117e-01 -5.85375582e-02 9.13297416e+01
1716.lowfreq: -7.6744 -1.4393 -0.0006 -0.0005 -0.0004 2.2206 9.3721 28.1177 42.1063
frequency: 8.9333 28.1109 42.0989 46.9137 49.0183 69.5820 76.5559 87.6195 98.1733 114.7049 132.1988 163.7664 179.6269 194.1733 211.1263 243.2434 255.5317 268.8626 278.0091 284.4436 296.0189 301.8482 305.8332 334.0128 376.6564 377.4851 409.8569 447.1144 465.3810 468.2834 474.0861 492.4709 497.2241 501.3184 531.4501 568.4519 611.7994 628.1868 633.6182 642.7684 653.2198 680.2124 717.4393 737.2231 834.2989 840.1422 846.7237 850.0795 884.0437 893.3147 896.5768 941.1437 957.0799 971.5438 989.7070 1010.1021 1011.6599 1021.9274 1072.4011 1078.9767 1110.5642 1130.4702 1136.3117 1143.0414 1147.4277 1164.4603 1188.7441 1196.0341 1217.4081 1230.4247 1284.5273 1345.5141 1373.0025 1409.4035 1427.2825 1504.7978 1523.5568 1593.4057 1600.1035 1630.3985 3066.6479 3131.3034 3147.2813 3190.4393 3198.3168 3209.5479 3436.6302
redmass: 9.3440 9.9937 14.4640 10.8204 4.5672 11.0622 6.6805 11.5194 7.9574 9.6416 10.4633 14.0823 13.7352 11.1467 6.5603 13.3141 13.3092 14.7759 15.6341 13.7358 17.9181 17.0182 16.8395 11.0267 5.3842 5.6265 2.9785 11.2855 17.4927 17.3766 16.0320 9.0648 9.1785 16.4080 3.1999 2.7337 5.7299 10.9212 11.5895 9.1698 11.2738 8.0751 1.2453 3.2588 1.6252 1.4751 1.6489 5.6136 11.7955 7.4596 9.0885 6.8181 3.2923 1.9740 1.3670 11.0875 3.3179 10.4776 11.2954 11.7416 7.9542 7.7849 11.1254 1.1488 8.8946 1.5396 5.3819 1.8166 1.4010 1.4514 1.8610 1.4501 5.7267 1.1191 2.9915 2.0579 2.6280 6.0051 4.2621 6.2940 1.0566 1.0914 1.1076 1.0905 1.0933 1.0951 1.0771
irintensity: 0.6766 0.5649 0.9649 2.3134 4.3325 1.8421 4.1815 0.3823 0.7611 0.5713 0.3358 0.3722 0.7921 7.9608 0.5599 0.0855 0.5983 0.5335 0.5642 1.2465 0.7222 0.6074 0.0553 24.8845 1.6932 2.1105 0.0277 3.0707 4.3144 4.9753 0.6445 1.4965 2.1286 0.2954 8.7152 7.4417 77.8906 10.2223 53.4187 23.6874 53.0542 5.3060 30.2109 1.3279 0.3094 63.8806 82.3784 11.0413 112.7638 76.0031 115.5663 5.8146 4.9354 4.5417 13.7558 14.7629 1.1023 15.8935 12.3235 13.0716 331.2989 347.6341 429.5934 0.2080 240.2330 55.7176 112.2821 23.0321 32.9739 36.0687 2.2801 54.1531 72.6999 34.1749 23.5841 74.0517 624.2478 175.6274 99.5930 49.6773 0.6457 9.9591 0.4164 3.9540 0.2842 1.2761 144.7227
temp: 298.150 k
press: 1.00000 atm
elementType: 53 9 9 9 9 9 9 9 9 9 8 7 6 6 6 6 6 6 6 6 6 6 6 6 1 1 1 1 1 1 1
symmnumber: 1
zpe: 471456.8 jmol-1
zpe.correction: 0.179568 hartree
zpe.thermalcorrener: 0.202565 hartree
zpe.thermalcorrenthalpy: 0.203509 hartree
zpe.thermalcorrgfe: 0.123198 hartree
zpe.sumelectzpe: -1499.764622 hartree
zpe.sumelectthermal: -1499.741625 hartree
zpe.sumelectthermalent: -1499.740681 hartree
zpe.sumelectthermalfe: -1499.820993 hartree
dipole: 4.3071 -1.4265 0.0408
dipole: 4.5373
quadrupole: -158.6115 -153.0311 -156.3573
quadrupole: -3.4491 0.3105 -0.0303
quadrupole: -2.6116 2.9689 -0.3573 -3.4491 0.3105 -0.0303
hfenergy: -1499.9441905 hartree
pointgroup: C01 [X(C12H7F9I1N1O1)]
dipole: -1.5590946 -0.86259 -0.1088787 debye
polarizability: 257.494404|20.1563307|176.7508074|10.6778792|1.1951808|92.0136427 unknown
InChI: InChI=1S/C12H7F9INO/c13-10(14,15)9(11(16,17)18,12(19,20)21)6-1-3-7(4-2-6)23-8(24)5-22/h1-4,23H,5H2
charge 0 multiplicity 1
31 atoms
I  -6.744809 -2.231176 -0.459629
F  1.945856 -1.985746 1.569094
F  3.906936 -0.934729 1.252218
F  2.281411 0.030658 2.50504
F  1.785113 -0.316029 -2.370522
F  3.860795 -0.32266 -1.498797
F  2.485381 -2.073816 -1.131031
F  1.856163 2.264998 1.127945
F  3.838372 1.588947 0.33262
F  2.190197 2.155136 -1.107915
O  -4.667806 1.673212 -0.342225
N  -3.855826 -0.536157 -0.294316
C  1.935263 0.012379 0.070176
C  0.384269 -0.078653 0.0170
C  2.518556 -0.724617 1.34512
C  2.527504 -0.665935 -1.234688
C  2.456865 1.500772 0.112266
C  -0.230779 -1.359495 -0.061005
C  -0.453293 1.064403 -0.038612
C  -1.624224 -1.483489 -0.15883
C  -1.853318 0.949155 -0.137407
C  -2.453871 -0.333224 -0.194395
C  -4.85091 0.41849 -0.361716
C  -6.30695 -0.046617 -0.478508
H  0.366114 -2.272693 -0.050583
H  -0.045484 2.075112 -0.009753
H  -2.068586 -2.484393 -0.214941
H  -2.478467 1.842613 -0.174316
H  -4.174636 -1.512705 -0.318525
H  -6.726205 0.319427 -1.428119
H  -6.883432 0.36823 0.361753
