program: Gaussian 09
title: 000127270
version: EM64L-G09RevD.01
frameworkgroup: C1[X(C6H12FO9P)]
method: RPBEPBE
basis: SDD
operation: Freq
keyword: #p
keyword: freq=noraman
keyword: PBEPBE/SDD
title: #p freq=noraman PBEPBE/SDD
converged: YES YES NO NO
title: Mulliken charges:
elementType: P F O O O O O O O O O C C C C C C H H H H H H H H H H H H
charge: 1.383586 -0.196728 -0.488057 -0.479480 -0.459630 -0.532005 -0.432385 -0.175920 -0.666603 -0.692854 -0.568560 -0.149432 -0.108449 -0.085295 -0.349439 -0.067725 0.167428 0.290138 0.278441 0.238887 0.244124 0.270891 0.236290 0.382152 0.376456 0.375917 0.393315 0.402714 0.412222
chargesum: 0.00000
title: Mulliken charges with hydrogens summed into heavy atoms:
elementType: P F O O O O O O O O O C C C C C C
charge: 1.383586 -0.196728 -0.105905 -0.103024 -0.083713 -0.532005 -0.039070 -0.175920 -0.263889 -0.280632 -0.568560 0.140707 0.169993 0.153592 0.165576 0.168566 0.167428
polarizability: 1.41960191e+02 1.72450980e+00 1.15286250e+02 7.51548144e-01 2.47320220e+00 9.88746128e+01
1716.lowfreq: -8.6032 -5.4772 -0.0017 -0.0009 0.0007 3.5013 20.5174 22.5680 32.6986
frequency: 20.2361 22.3988 32.6579 46.1356 61.9442 74.5148 93.7457 110.2602 133.2068 153.7588 170.2145 196.0892 215.5943 226.5372 249.4644 274.6543 283.4782 291.1125 305.1386 343.4504 352.3604 378.6680 380.7768 414.8024 434.9886 443.7858 464.2528 477.9747 486.1771 502.1408 531.7467 586.8069 603.8932 627.9584 681.0665 723.2488 737.6333 752.8572 830.4581 837.9231 890.8803 932.1848 939.1290 977.4784 1004.6245 1019.6382 1023.4670 1040.9052 1056.3400 1070.0486 1083.7270 1093.7371 1099.0240 1195.2114 1208.9016 1235.0765 1239.2630 1245.1828 1287.5282 1303.4500 1319.3725 1322.1972 1336.1512 1349.0877 1375.6944 1384.5765 1398.1022 1444.9787 1707.9774 2962.8342 3009.5711 3022.9231 3025.1146 3031.6066 3117.3415 3521.9205 3532.2562 3533.3955 3550.9093 3592.9517 3605.7243
redmass: 9.4827 7.3143 8.2174 7.7384 8.3556 6.9379 6.4925 8.1417 6.3673 3.9797 4.8492 3.1044 2.3506 7.6100 5.1610 3.4761 4.6651 5.9161 2.4138 4.3703 5.2722 2.0498 4.2746 5.0120 3.5207 1.6014 1.2999 1.3724 1.6017 3.0687 2.2344 4.6118 3.3256 2.9521 5.6253 8.8248 5.7823 4.9819 4.7542 3.5188 3.5423 4.8920 4.2213 4.5973 1.3130 1.5861 1.8621 3.9219 2.8074 2.1438 3.0312 7.5483 2.8248 1.2092 1.1700 1.1884 1.3399 1.1798 1.2848 1.2351 1.4099 1.4273 1.2475 1.2513 1.4988 1.7041 1.5604 1.0875 10.1682 1.0821 1.0839 1.0855 1.0838 1.0600 1.1072 1.0651 1.0644 1.0650 1.0657 1.0663 1.0665
irintensity: 1.9417 1.2945 1.2675 2.1675 0.9707 0.2728 4.0867 2.2671 4.2443 9.3098 2.6364 41.8237 37.9406 0.9389 2.2611 67.9138 7.4565 7.4093 27.2453 81.0207 9.8430 103.7618 5.4359 11.4781 23.6218 9.2906 181.1278 118.6997 123.3964 51.1486 59.3278 40.7497 104.6157 78.1578 95.9756 195.6540 103.9307 116.6365 17.0708 12.2561 13.0970 129.5126 113.1084 142.9588 24.8991 66.7297 196.1716 112.6517 32.2814 50.6420 33.3054 188.5857 52.4682 33.2838 38.2218 11.5045 2.8451 27.8403 17.6087 10.6913 27.6692 17.7677 29.7514 7.3502 46.6189 18.1907 6.9089 11.5429 250.7937 33.1829 7.6933 15.5535 29.8678 15.1567 5.4253 42.5308 41.3010 28.8432 22.9130 80.8564 71.9458
temp: 298.150 k
press: 1.00000 atm
elementType: 15 9 8 8 8 8 8 8 8 8 8 6 6 6 6 6 6 1 1 1 1 1 1 1 1 1 1 1 1
symmnumber: 1
zpe: 530212.4 jmol-1
zpe.correction: 0.201947 hartree
zpe.thermalcorrener: 0.222147 hartree
zpe.thermalcorrenthalpy: 0.223092 hartree
zpe.thermalcorrgfe: 0.150850 hartree
zpe.sumelectzpe: -1352.516947 hartree
zpe.sumelectthermal: -1352.496747 hartree
zpe.sumelectthermalent: -1352.495803 hartree
zpe.sumelectthermalfe: -1352.568044 hartree
dipole: 3.2209 -2.4155 -3.9013
dipole: 5.6062
quadrupole: -133.2375 -94.2632 -105.4919
quadrupole: -5.5810 2.3770 2.3646
quadrupole: -22.2400 16.7343 5.5056 -5.5810 2.3770 2.3646
hfenergy: -1352.7188943 hartree
pointgroup: C01 [X(C6H12F1O9P1)]
dipole: 1.2916626 -0.9927857 -1.4868874 debye
polarizability: 141.9232366|0.7672161|115.2084535|2.4258352|2.4578123|98.9893629 unknown
InChI: InChI=1S/C6H12FO9P/c7-3(6(11)12)5(10)4(9)2(8)1-16-17(13,14)15/h2-5,8-11,13-14H,1H2
charge 0 multiplicity 1
29 atoms
P  3.529725 -0.873912 0.17844
F  -2.180868 -0.208441 1.758138
O  -0.849087 2.739101 -0.912969
O  1.217135 2.588486 0.838357
O  -3.010552 1.0824 -0.853544
O  2.845348 0.62304 -0.281183
O  -2.649135 -2.114505 -1.296817
O  -4.092547 -1.808769 0.513721
O  3.364859 -1.923818 -1.185941
O  2.228564 -1.488373 1.118066
O  4.978296 -0.755468 0.793454
C  -0.836512 1.668798 0.09968
C  0.617434 1.29853 0.451939
C  -1.691592 0.552387 -0.529202
C  1.410261 0.701216 -0.717547
C  -1.888523 -0.649955 0.410496
C  -3.028062 -1.556983 -0.065931
H  -1.32918 2.020424 1.026815
H  0.636344 0.596422 1.308059
H  -1.202597 0.177056 -1.453895
H  1.052022 -0.300103 -1.014749
H  1.419807 1.382435 -1.583179
H  -0.955914 -1.244438 0.458056
H  -0.261853 3.461328 -0.56555
H  2.196309 2.459607 0.933519
H  -2.868809 1.982562 -1.251211
H  -3.392909 -2.666687 -1.658843
H  4.168097 -1.980188 -1.76443
H  2.334339 -2.41275 1.456553
