program: Gaussian 09
title: 000127317
version: EM64L-G09RevD.01
frameworkgroup: C1[X(C17H24ClN3O2)]
method: RPBEPBE
basis: SDD
operation: Freq
keyword: #p
keyword: freq=noraman
keyword: PBEPBE/SDD
title: #p freq=noraman PBEPBE/SDD
converged: NO YES NO NO
title: Mulliken charges:
elementType: Cl O O N N N C C C C C C C C C C C C C C C C C H H H H H H H H H H H H H H H H H H H H H H H H
charge: -0.080037 -0.385001 -0.412203 -0.120726 -0.414744 -0.682703 -0.005582 0.028039 -0.507745 -0.419947 -0.064443 -0.388530 -0.412113 -0.434028 -0.439671 -0.763393 0.238187 0.180249 0.151200 -0.311751 -0.566594 -0.425403 0.689874 0.149598 0.171218 0.216578 0.214695 0.204260 0.195967 0.274462 0.226672 0.179587 0.190865 0.203063 0.234855 0.210492 0.193025 0.218152 0.220720 0.214961 0.228790 0.308278 0.214608 0.250865 0.384833 0.322279 0.318241
chargesum: 0.00000
title: Mulliken charges with hydrogens summed into heavy atoms:
elementType: Cl O O N N N C C C C C C C C C C C C C C C C C
charge: -0.080037 -0.385001 -0.027370 -0.120726 -0.106466 -0.042183 0.144016 0.199257 -0.076471 -0.019720 0.210019 0.017729 -0.018185 0.011320 -0.028494 -0.098923 0.238187 0.180249 0.151200 -0.097143 -0.315728 -0.425403 0.689874
polarizability: 3.00709634e+02 1.38658602e+01 2.42634833e+02 1.31645851e+01 -1.48781659e+00 1.52649244e+02
1716.lowfreq: -8.2426 -0.0012 -0.0010 0.0008 4.1255 11.2760 15.0378 26.7693 36.5508
frequency: 14.1015 24.3164 36.2755 49.8488 82.5205 91.8417 114.9070 132.6815 137.9906 172.5054 199.6752 210.9058 240.7205 251.8278 256.7267 285.2146 293.2340 317.0545 329.6080 349.3227 369.0885 377.8514 380.6285 402.3870 410.5869 425.0659 428.5684 435.5910 452.1580 475.7254 482.9257 488.4986 502.5976 520.8919 532.1161 562.8635 591.5319 633.8920 669.3310 686.3552 696.2287 699.4071 734.2798 736.5849 803.7125 824.6413 829.4101 842.1883 842.4735 852.5968 877.3474 898.7889 906.3123 953.6767 956.9801 972.0037 973.8758 991.6765 995.1374 1013.2389 1038.2999 1043.5073 1064.1591 1075.0370 1091.9729 1096.7304 1110.5959 1121.6968 1137.9880 1147.6775 1157.3395 1181.8869 1205.3056 1205.9502 1220.7434 1231.6125 1247.8301 1255.4272 1271.3679 1279.5543 1287.0118 1298.0139 1309.4992 1309.9290 1322.6517 1338.7438 1342.3173 1344.7181 1346.7296 1352.1232 1357.1195 1365.8678 1367.7334 1383.2253 1389.8328 1414.0606 1434.4795 1439.6207 1446.0121 1453.9616 1458.3889 1467.7976 1470.1171 1482.6744 1486.4724 1495.5379 1521.5941 1561.4838 1579.5569 1630.7275 1660.2563 2653.5178 2723.9092 2800.5671 2829.1870 2966.5157 2975.3209 2977.6502 2986.5326 2990.5834 3001.3923 3031.5274 3036.4839 3039.3736 3046.7714 3054.3844 3067.1223 3069.5504 3081.1119 3090.7588 3141.6059 3160.6144 3550.3238 3559.6892 3697.6599
redmass: 4.9256 5.0928 4.2774 5.3897 3.6987 3.5725 7.8959 3.0897 5.7726 3.1645 4.2293 1.6478 4.5537 2.2620 4.1731 2.0461 3.2979 2.0172 4.9211 4.3413 3.7586 4.9451 3.9606 2.7017 2.4814 3.5374 3.4879 1.2179 3.1648 1.6353 1.8081 2.0215 2.5017 1.6110 1.8153 3.5085 7.3729 8.3170 4.8320 4.3694 3.3280 2.7290 5.0499 5.6650 2.4462 2.0771 1.7719 2.1179 1.8289 1.6456 2.8836 2.3482 1.8946 2.0391 2.1177 1.9404 1.0953 2.0630 2.0313 2.2859 1.6202 1.5714 1.7236 2.1197 2.4475 2.4200 2.2579 1.8996 2.4763 1.8307 2.3778 1.6007 1.4154 2.2298 1.5869 1.5719 1.3278 1.6343 1.2908 1.6004 1.2485 1.3184 1.2798 2.0821 1.6639 1.4582 1.5335 2.2440 1.5805 1.4494 1.9194 1.8048 1.4271 1.2525 1.3946 3.1859 4.2859 1.0933 1.0887 1.0893 1.0903 1.0660 1.0912 1.1086 2.5705 1.0492 3.9939 6.1254 2.5515 1.2732 3.9443 1.0727 1.0776 1.0800 1.0714 1.0626 1.0602 1.0610 1.0369 1.0606 1.0619 1.0966 1.1014 1.0860 1.1034 1.1010 1.0872 1.1018 1.0983 1.0986 1.0909 1.0919 1.0456 1.0768 1.1037
irintensity: 0.0345 0.1240 0.0927 6.1892 0.6516 0.2880 0.0577 0.5802 0.4195 0.6480 6.4896 2.0516 1.8290 0.3549 3.8265 0.6713 0.4687 2.3453 18.0371 11.1681 1.6121 16.4342 5.0898 1.6059 7.2252 6.6412 3.2689 84.8531 5.4517 112.1016 70.0545 32.4447 5.5972 45.8694 2.6869 12.6667 9.7317 4.8113 18.2916 31.8597 4.2346 3.6549 3.7308 2.2575 9.9978 0.6015 0.8934 3.0484 1.3667 72.0250 5.0613 5.0840 16.0013 2.1186 1.2984 4.5845 132.4045 6.0225 3.3569 13.3815 4.8524 18.7724 22.6133 11.6974 21.4341 29.6933 9.6164 8.7894 10.0520 1.4698 14.9416 10.2790 7.1252 77.7641 5.3532 8.3802 25.6060 11.3023 5.2780 210.9696 5.4726 1.2115 27.7307 4.2469 29.4617 11.5822 32.6064 158.9493 34.0514 7.1578 48.1248 17.5352 40.4325 20.6697 2.1829 220.2641 3.0959 6.1557 9.7800 4.7992 28.7561 4.5944 9.9708 51.4366 517.2038 10.3274 411.1321 81.2933 59.4032 84.5989 512.8967 613.9757 125.6550 61.8435 138.4454 35.7496 29.8515 24.0099 38.6476 33.2800 22.0449 49.3488 32.2914 25.4681 44.5767 53.2703 31.4300 37.0464 38.9855 36.7804 7.4666 5.4535 129.8732 40.1045 39.6914
temp: 298.150 k
press: 1.00000 atm
elementType: 17 8 8 7 7 7 6 6 6 6 6 6 6 6 6 6 6 6 6 6 6 6 6 1 1 1 1 1 1 1 1 1 1 1 1 1 1 1 1 1 1 1 1 1 1 1 1
symmnumber: 1
zpe: 1026728.4 jmol-1
zpe.correction: 0.391060 hartree
zpe.thermalcorrener: 0.412859 hartree
zpe.thermalcorrenthalpy: 0.413803 hartree
zpe.thermalcorrgfe: 0.339147 hartree
zpe.sumelectzpe: -1435.266486 hartree
zpe.sumelectthermal: -1435.244687 hartree
zpe.sumelectthermalent: -1435.243743 hartree
zpe.sumelectthermalfe: -1435.318400 hartree
dipole: -1.0864 3.9252 0.1078
dipole: 4.0742
quadrupole: -120.9201 -156.9613 -144.9527
quadrupole: 11.2052 4.4660 0.4891
quadrupole: 20.0246 -16.0166 -4.0080 11.2052 4.4660 0.4891
hfenergy: -1435.6575461 hartree
pointgroup: C01 [X(C17H24Cl1N3O2)]
dipole: 0.5203769 1.5074039 -0.1621672 debye
polarizability: 298.5570004|-16.0096477|243.9840971|16.0048747|-7.0051886|153.4526128 unknown
InChI: InChI=1S/C17H24ClN3O2/c1-10-3-2-4-12-7-11(5-6-21(10)12)20-17(23)13-8-14(18)15(19)9-16(13)22/h8-12,20,22H,2-7,19H2,1H3
charge 0 multiplicity 1
47 atoms
Cl -3.386582 3.562749 -0.364586
O  -1.424655 -2.599553 0.434409
O  -3.872034 -2.43097 -0.089161
N  3.524314 -0.312723 -0.38754
N  -0.038291 -0.757244 0.580654
N  -5.904522 1.90073 -0.79112
C  2.882081 0.325481 0.802214
C  4.267535 0.680235 -1.238286
C  2.180659 -0.742491 1.678156
C  3.909689 1.09553 1.659222
C  1.146747 -1.586206 0.909362
C  2.515412 -1.071832 -1.184676
C  5.313198 1.44367 -0.391144
C  1.820356 -2.166064 -0.357054
C  4.674487 2.138296 0.825351
C  4.972039 -0.00272 -2.430827
C  -1.277679 -1.305069 0.367696
C  -2.439705 -0.439545 0.073837
C  -3.722532 -1.065881 -0.150221
C  -2.375456 0.979953 0.000463
C  -4.862623 -0.286075 -0.43727
C  -3.512318 1.731844 -0.283192
C  -4.791725 1.127863 -0.512037
H  2.113985 1.080468 0.453745
H  3.5413 1.439082 -1.64238
H  2.960282 -1.425485 2.065022
H  1.707333 -0.247404 2.548157
H  4.625249 0.364855 2.086645
H  3.379479 1.575398 2.5049
H  0.77873 -2.418976 1.534562
H  3.024836 -1.551509 -2.035725
H  1.742561 -0.378772 -1.61358
H  5.817397 2.184609 -1.040694
H  6.08225 0.722276 -0.049171
H  1.067204 -2.68932 -0.97252
H  2.573464 -2.911208 -0.036915
H  3.974746 2.926878 0.478382
H  5.446271 2.639373 1.439671
H  4.273385 -0.334095 -3.217729
H  5.676507 0.708785 -2.898618
H  5.547667 -0.878055 -2.077935
H  0.09538 0.250774 0.501859
H  -1.436511 1.518031 0.16881
H  -5.812596 -0.804399 -0.599266
H  -2.92767 -2.816106 0.13981
H  -5.823573 2.914094 -0.835121
H  -6.808872 1.466729 -0.949662
