program: Gaussian 09
title: 000127217
version: EM64L-G09RevD.01
frameworkgroup: C1[X(C15H9Br2NO3)]
method: RPBEPBE
basis: SDD
operation: Freq
keyword: #p
keyword: freq=noraman
keyword: PBEPBE/SDD
title: #p freq=noraman PBEPBE/SDD
converged: NO YES NO NO
title: Mulliken charges:
elementType: Br Br O O O N C C C C C C C C C C C C C C C H H H H H H H H H
charge: 0.021075 0.021190 -0.244340 -0.408711 -0.191932 -0.224147 0.277018 0.275617 0.168332 0.168019 0.066248 -0.572211 -0.324027 -0.324926 -0.280322 -0.280453 -0.194899 -0.194889 -0.267252 -0.267173 0.199474 0.297297 0.298166 0.240524 0.241369 0.300522 0.300525 0.254059 0.254116 0.391732
chargesum: 0.00000
title: Mulliken charges with hydrogens summed into heavy atoms:
elementType: Br Br O O O N C C C C C C C C C C C C C C C
charge: 0.021075 0.021190 -0.244340 -0.016979 -0.191932 -0.224147 0.277018 0.275617 0.168332 0.168019 0.066248 0.023252 -0.083503 -0.083557 0.020200 0.020072 0.059160 0.059228 -0.267252 -0.267173 0.199474
polarizability: 3.68482777e+02 2.25077383e-01 2.32804820e+02 -1.89647685e-01 -1.27788362e+01 9.08713864e+01
1716.lowfreq: -3.5221 -0.0002 0.0001 0.0003 2.2877 5.3354 14.6523 31.9911 44.6276
frequency: 14.5799 31.9807 44.6260 45.4471 72.6343 78.4831 127.9469 151.8896 152.5949 160.9560 190.1444 237.6413 261.5016 288.5518 310.8433 340.7415 344.5539 394.6389 405.3047 411.5980 459.5989 467.3319 476.3924 504.7360 524.8096 542.2175 551.2943 597.7715 632.5657 634.6655 655.9403 667.7939 681.3459 713.3491 721.8182 793.4858 807.7938 809.4227 809.9062 841.0697 848.8515 935.5053 940.1915 947.6220 955.1920 958.0443 1008.4745 1033.4140 1063.2799 1076.1398 1085.7175 1138.9454 1152.0629 1184.6776 1206.9837 1240.1565 1256.3503 1264.4593 1266.9684 1293.2633 1350.9994 1356.5218 1390.4350 1394.5237 1396.7332 1437.8240 1464.1774 1469.4429 1483.3944 1545.9345 1551.9847 1582.2372 1599.4636 1614.2472 1686.3224 3036.9617 3085.4360 3158.1554 3158.9948 3166.0929 3166.6092 3178.3406 3179.1753 3519.9921
redmass: 9.2101 15.8626 7.4584 10.1786 6.5290 20.3476 8.6719 5.4226 6.2821 9.7894 21.2328 7.9658 8.1177 7.5310 5.7211 6.3965 8.3950 7.0142 3.9072 3.9565 3.3543 7.0959 5.5602 1.6713 5.5251 4.1469 3.7468 5.6097 3.8485 1.6481 6.0283 6.8740 5.3646 6.8942 3.8157 2.1066 1.5572 6.6929 2.4753 4.3616 3.7862 1.3778 1.4281 5.7348 1.4161 1.4037 2.7309 3.2547 3.0016 1.8823 2.5118 2.0192 3.9985 1.2988 1.3699 1.6476 1.6241 1.6631 1.4282 4.0138 2.4274 1.6559 11.6399 7.5397 5.3098 3.3900 3.5945 1.8732 1.3253 10.7715 7.8912 9.3989 7.0419 7.4325 8.7905 1.0615 1.1001 1.0876 1.0878 1.0923 1.0923 1.0968 1.0967 1.0644
irintensity: 0.3912 1.1349 0.7589 0.3967 0.0012 0.0778 1.1263 0.3229 0.6314 1.0724 0.0182 0.2570 5.3022 0.2315 0.4228 0.1588 5.9747 8.5437 6.0814 0.4294 5.2245 38.5010 25.1280 29.3974 37.9330 0.6480 38.5131 3.1550 10.5005 59.3338 115.7440 2.3746 0.1046 1.0623 0.0361 8.2536 2.4005 53.6986 71.3134 7.9841 0.0124 0.0569 12.2989 52.7515 2.8229 8.3360 6.1599 322.8868 30.2302 12.4232 15.4909 40.4855 7.7063 16.6679 12.4186 2.8114 37.9980 145.7003 1.7532 63.9566 9.9295 17.3692 2.1389 15.2516 13.8258 10.5265 612.7385 108.6233 21.8036 143.2478 13.0269 91.1588 34.0328 8.8910 174.3818 21.1180 0.2559 3.4494 5.6913 7.0546 3.5584 2.3158 19.9282 44.6444
temp: 298.150 k
press: 1.00000 atm
elementType: 35 35 8 8 8 7 6 6 6 6 6 6 6 6 6 6 6 6 6 6 6 1 1 1 1 1 1 1 1 1
symmnumber: 1
zpe: 537065.1 jmol-1
zpe.correction: 0.204557 hartree
zpe.thermalcorrener: 0.222699 hartree
zpe.thermalcorrenthalpy: 0.223644 hartree
zpe.thermalcorrgfe: 0.154234 hartree
zpe.sumelectzpe: -882.913292 hartree
zpe.sumelectthermal: -882.895150 hartree
zpe.sumelectthermalent: -882.894206 hartree
zpe.sumelectthermalfe: -882.963616 hartree
dipole: 0.0383 7.9289 -1.9112
dipole: 8.1561
quadrupole: -142.0411 -123.9504 -145.3609
quadrupole: 0.1005 0.1723 -2.8839
quadrupole: -4.9236 13.1671 -8.2434 0.1005 0.1723 -2.8839
hfenergy: -883.1178497 hartree
pointgroup: C01 [X(C15H9Br2N1O3)]
dipole: 0.0420018 3.1056788 -0.8060559 debye
polarizability: 368.4753139|-0.9984672|232.324664|-0.5429672|-15.2342157|91.3590054 unknown
InChI: InChI=1S/C15H9Br2NO3/c16-8-1-3-12-10(5-8)15(21)11-6-9(17)2-4-13(11)18(12)7-14(19)20/h1-6,19H,7H2
charge 0 multiplicity 1
30 atoms
Br -5.419772 -2.002752 0.237179
Br 5.374949 -2.110786 0.230883
O  -0.034352 -3.207579 0.117172
O  0.097858 4.634019 -0.103006
O  0.005422 3.030846 1.587271
N  0.007302 0.945508 -0.425944
C  -1.229533 0.284742 -0.247145
C  1.230665 0.259675 -0.249157
C  -1.264767 -1.134082 -0.06107
C  1.237622 -1.159455 -0.062189
C  -0.021578 -1.938015 -0.000631
C  0.023047 2.355966 -0.812161
C  -2.462974 1.000254 -0.253955
C  2.478327 0.950181 -0.259895
C  -2.5081 -1.805007 0.08103
C  2.467376 -1.855167 0.078709
C  -3.686418 0.326621 -0.111668
C  3.688145 0.252089 -0.118532
C  -3.70143 -1.080596 0.046735
C  3.675018 -1.154874 0.042051
C  0.039631 3.321841 0.378931
H  -0.853274 2.592614 -1.438238
H  0.897341 2.57173 -1.44805
H  -2.490743 2.089612 -0.331587
H  2.528024 2.038518 -0.341699
H  -2.477597 -2.890537 0.215102
H  2.415442 -2.939838 0.213401
H  -4.621823 0.893285 -0.110898
H  4.634845 0.799678 -0.121061
H  0.103546 5.277511 0.656522
