program: Gaussian 09
title: 000127169
version: EM64L-G09RevD.01
frameworkgroup: C1[X(C9H18N2O3)]
method: RPBEPBE
basis: SDD
operation: Freq
keyword: #p
keyword: freq=noraman
keyword: PBEPBE/SDD
title: #p freq=noraman PBEPBE/SDD
converged: YES YES NO NO
title: Mulliken charges:
elementType: O O O N N C C C C C C C C C H H H H H H H H H H H H H H H H H H
charge: -0.444562 -0.327158 -0.325195 -0.064123 -0.411046 -0.355928 0.019904 -0.633293 -0.606786 -0.598281 -0.628228 0.123838 0.257332 -0.770422 0.238167 0.284131 0.291405 0.281137 0.215014 0.340118 0.233739 0.326391 0.237355 0.229283 0.359508 0.219741 0.236421 0.221291 0.321482 0.251181 0.257967 0.219619
chargesum: 0.00000
title: Mulliken charges with hydrogens summed into heavy atoms:
elementType: O O O N N C C C C C C C C C
charge: -0.444562 -0.327158 -0.325195 -0.064123 -0.089564 0.166371 0.311309 0.202975 0.190698 0.210250 -0.170516 0.123838 0.257332 -0.041656
polarizability: 1.40477920e+02 4.42852138e+00 1.39519976e+02 6.36473289e-01 7.02667807e+00 9.13184789e+01
1716.lowfreq: -13.6667 -5.1138 -0.0011 -0.0010 -0.0008 9.1277 33.9556 70.0941 83.8652
frequency: 33.2715 69.9802 83.8191 89.2251 114.2861 125.0442 132.2451 160.1179 205.4139 231.9769 262.7834 274.1471 308.1063 309.9690 337.0414 366.8059 371.5742 401.3810 436.7149 448.2599 456.9240 490.8782 530.2247 556.6700 563.5795 615.8591 620.0894 653.1614 733.6123 829.9894 843.7402 879.0095 902.5870 930.1634 933.2012 954.8731 986.3285 1016.2072 1044.0417 1057.6508 1074.4850 1109.6636 1119.9823 1127.2917 1163.3210 1206.4512 1221.4483 1232.3031 1233.8993 1255.8708 1263.5907 1287.7155 1316.8146 1331.3168 1377.8062 1389.7744 1397.1811 1418.5196 1430.6119 1443.7882 1448.7326 1451.5256 1453.1848 1460.7109 1478.5490 1481.0403 1484.2965 1492.2109 1505.0196 1533.4580 1581.5860 1590.7694 2957.9023 2970.7287 2982.1684 2998.8997 3002.6087 3039.9335 3046.8274 3088.2281 3092.0166 3094.3770 3097.2296 3105.2637 3115.5413 3123.8031 3124.7358 3126.6612 3135.2157 3545.5482
redmass: 6.6234 2.4500 1.3948 4.1998 3.3730 4.0618 2.8206 4.2205 4.8027 6.1340 2.9565 1.0731 4.3812 3.2558 1.1467 2.0296 2.2041 1.1173 2.2466 2.6615 2.7459 3.6240 2.7901 3.0540 1.4734 2.3989 3.6900 4.7961 3.7966 3.9879 3.6381 2.6728 3.0477 3.2415 3.7677 2.5925 1.6584 2.3060 1.6630 1.1983 2.2136 3.0304 1.2915 1.4563 1.3271 2.4180 1.4050 2.1758 1.7801 1.7448 1.5313 1.7182 1.2709 1.2306 1.1404 1.2302 1.1817 1.1789 1.1311 1.0997 1.0577 1.0682 1.1072 1.2334 1.0571 1.6088 1.1499 1.0645 1.0547 1.0538 8.6061 5.4567 1.0394 1.0375 1.0603 1.0360 1.0318 1.0613 1.1001 1.0987 1.0846 1.1003 1.0983 1.1006 1.1043 1.1042 1.1047 1.1051 1.1045 1.0784
irintensity: 3.0715 1.2716 1.3459 16.7651 13.6989 2.6551 5.6037 23.0336 29.8149 3.3662 3.6195 0.1010 8.5101 0.7435 1.0114 0.1673 0.5964 1.1752 2.3167 6.8176 10.1161 17.0122 8.7260 6.4341 71.4887 13.1719 3.4860 11.1512 1.0556 33.1213 16.5560 17.8007 9.3347 26.5011 20.7096 7.0721 1.4347 1.2869 12.4813 1.3883 4.2294 10.0016 1.2876 2.1321 1.5132 141.3611 11.1648 95.0793 18.7281 5.7767 38.1668 29.0456 1.0817 14.3938 35.1575 54.6942 4.9279 9.5585 73.2032 8.0342 31.4913 27.2817 75.4341 104.3748 9.3395 129.8019 22.0408 8.3286 13.4618 47.5583 420.4294 255.4299 65.3916 119.3921 16.6034 10.3563 43.6972 23.4137 15.1835 4.4592 6.6080 22.6283 9.2162 16.4583 3.2620 27.7391 8.2829 7.2982 10.6273 23.4321
temp: 298.150 k
press: 1.00000 atm
elementType: 8 8 8 7 7 6 6 6 6 6 6 6 6 6 1 1 1 1 1 1 1 1 1 1 1 1 1 1 1 1 1 1
symmnumber: 1
zpe: 714000.5 jmol-1
zpe.correction: 0.271948 hartree
zpe.thermalcorrener: 0.287827 hartree
zpe.thermalcorrenthalpy: 0.288771 hartree
zpe.thermalcorrgfe: 0.229175 hartree
zpe.sumelectzpe: -687.766089 hartree
zpe.sumelectthermal: -687.750211 hartree
zpe.sumelectthermalent: -687.749267 hartree
zpe.sumelectthermalfe: -687.808863 hartree
dipole: 8.9707 5.8143 -2.8226
dipole: 11.0565
quadrupole: -115.0509 -76.3300 -82.3046
quadrupole: -27.9033 -0.5392 -1.4641
quadrupole: -23.8224 14.8985 8.9239 -27.9033 -0.5392 -1.4641
hfenergy: -688.0380379 hartree
pointgroup: C01 [X(C9H18N2O3)]
dipole: 4.2242745 0.3989809 0.9584385 debye
polarizability: 143.6300778|1.8960983|131.6417472|-8.0818157|13.3452275|96.0445495 unknown
InChI: InChI=1S/C9H18N2O3/c1-7(12)10-8(5-9(13)14)6-11(2,3)4/h8,10H,5-6H2,1-4H3
charge 0 multiplicity 1
32 atoms
O  -1.800794 -1.551059 -0.680048
O  -3.737298 -0.741553 0.352524
O  2.502875 1.169695 -0.358054
N  1.150076 -1.85638 -0.161754
N  0.51423 1.676323 0.709334
C  0.467303 -0.826337 0.818092
C  -0.188193 0.456646 0.223441
C  0.98838 -1.505175 -1.641729
C  2.639883 -1.929984 0.155107
C  0.496661 -3.222772 0.063405
C  -1.682829 0.531776 0.599287
C  -2.50062 -0.697111 0.042893
C  1.807637 1.975961 0.351459
C  2.367439 3.305297 0.840005
H  1.259072 -0.538671 1.529365
H  -0.308393 -1.401009 1.342045
H  -0.119103 0.443364 -0.873764
H  1.521803 -0.562923 -1.833968
H  1.440148 -2.32544 -2.224396
H  -0.098273 -1.434686 -1.827112
H  3.110747 -2.662561 -0.520085
H  3.064959 -0.92639 -0.000838
H  2.770293 -2.253048 1.200543
H  0.634329 -3.512784 1.1177
H  -0.574337 -3.095904 -0.182067
H  0.984659 -3.959343 -0.595795
H  -2.136877 1.450095 0.179919
H  -1.822832 0.571859 1.698377
H  -0.030115 2.343917 1.259195
H  3.314667 3.128175 1.377115
H  2.602135 3.93918 -0.032983
H  1.676469 3.855442 1.50129
