program: Gaussian 09
title: 000127174
version: EM64L-G09RevD.01
frameworkgroup: C1[X(C14H13N5O7)]
method: RPBEPBE
basis: SDD
operation: Freq
keyword: #p
keyword: freq=noraman
keyword: PBEPBE/SDD
title: #p freq=noraman PBEPBE/SDD
converged: NO YES NO NO
title: Mulliken charges:
elementType: O O O O O O O N N N N N C C C C C C C C C C C C C C H H H H H H H H H H H H H
charge: -0.275834 -0.228891 -0.450060 -0.425441 -0.197628 -0.456441 -0.256441 -0.169293 -0.074442 -0.273937 -0.040458 -0.598813 -0.215790 -0.169138 -0.089064 0.319783 0.216152 -0.424981 -0.517136 0.147531 0.298037 -0.185407 -0.118981 0.176277 0.167583 -0.259515 0.274933 0.321672 0.239815 0.303176 0.246949 0.266372 0.365849 0.275873 0.385716 0.272123 0.452311 0.353595 0.343946
chargesum: 0.00000
title: Mulliken charges with hydrogens summed into heavy atoms:
elementType: O O O O O O O N N N N N C C C C C C C C C C C C C C
charge: -0.275834 -0.228891 -0.084212 -0.039726 -0.197628 -0.004130 -0.256441 -0.169293 -0.074442 -0.273937 -0.040458 0.098727 0.059143 0.152534 0.150751 0.319783 0.216152 -0.121805 -0.003816 0.147531 0.298037 0.090466 -0.118981 0.176277 0.167583 0.012608
polarizability: 2.86774982e+02 3.89334999e+00 2.14188532e+02 4.24788750e+00 2.80071922e-01 1.23937289e+02
1716.lowfreq: -3.0706 0.0006 0.0007 0.0010 0.8224 7.3368 32.8979 39.2573 44.3934
frequency: 32.8605 39.2460 44.3902 64.1359 81.2022 89.5681 92.5650 121.1378 132.1452 150.3348 161.6690 188.3831 209.4027 225.2069 240.8450 263.3504 279.3617 298.0256 302.4118 305.2599 348.8185 353.5525 369.1965 391.0810 411.7059 433.7335 474.2331 518.3235 528.1841 532.5493 556.8218 562.1614 571.1187 575.3774 579.3790 589.2143 600.5707 621.5568 637.3608 649.6629 666.0182 676.3914 708.0156 713.0905 722.6234 765.8124 789.6756 794.6568 809.0070 827.5890 848.9912 866.0156 877.9840 890.8823 919.7136 934.0454 955.7367 964.6711 978.0459 1011.7915 1020.6327 1025.7424 1049.0694 1051.9422 1068.4149 1075.0759 1135.7100 1160.4105 1165.8114 1183.5465 1200.7557 1207.0553 1219.2340 1230.4387 1243.3336 1244.5683 1251.5141 1270.0014 1280.8271 1285.5568 1297.6744 1314.0863 1325.1270 1342.2640 1352.9248 1380.6774 1398.2114 1419.7792 1431.6005 1445.8332 1451.8512 1478.2532 1548.0072 1584.4683 1600.8928 1641.5736 1665.8370 1689.0883 2138.6473 2975.5107 3033.2339 3053.3901 3064.6725 3124.7086 3176.3112 3226.0009 3233.2870 3513.3908 3532.2200 3591.1166 3685.4651
redmass: 7.8849 10.8316 7.6237 9.2573 7.8439 6.2887 7.0883 6.5512 7.9465 8.0295 6.8722 5.1360 6.5497 5.8069 7.0623 3.9445 5.5553 3.5772 1.4394 4.3187 5.8036 7.6109 6.2500 3.4238 3.7426 5.3715 3.5576 5.6500 5.2904 6.5817 1.9145 1.3805 1.5432 2.4946 2.1970 5.1161 4.8952 2.9985 5.8213 4.1201 6.3554 7.2039 6.3959 6.6426 4.5294 4.9056 4.0469 4.1679 2.1783 1.8182 3.9417 6.4840 5.3186 5.1067 4.1840 1.4370 3.1982 2.9302 3.0689 4.6678 7.1392 4.4414 3.4920 2.8479 2.3095 3.8514 2.6010 2.1176 1.8657 1.7719 1.5437 1.7905 1.5189 1.3003 1.7092 1.8927 1.7319 2.1535 2.0986 1.9673 1.5857 4.3647 1.6326 2.9539 1.9882 1.9463 2.7915 1.9709 1.0861 2.7030 1.3571 3.3901 7.0993 1.8023 7.1389 3.0934 9.9526 9.2299 1.1093 1.0834 1.0619 1.0864 1.0857 1.1003 1.0938 1.0988 1.0993 1.0642 1.0447 1.0665 1.1057
irintensity: 1.1470 1.5289 0.9463 1.2709 1.3881 0.6241 2.6679 2.5753 4.6605 2.5516 2.5118 4.3843 5.8587 9.8765 5.8541 25.1431 4.9864 21.8698 120.8540 3.8671 25.6190 12.0218 4.4503 9.7385 11.9083 19.4887 1.6065 1.7819 8.9576 34.2805 107.3367 37.0739 83.4204 51.2047 47.9876 18.2530 41.3320 46.6168 18.5113 52.0641 23.1866 2.6620 49.1868 19.5605 21.5258 30.5982 150.3180 29.1131 26.4614 9.4139 2.6032 35.1579 39.2784 96.6892 61.7352 12.9660 122.0408 23.7597 18.4016 27.7623 59.2878 21.2750 186.0886 71.6962 32.7193 14.5551 6.9677 265.2502 142.4174 60.8264 23.0656 55.8827 53.4872 6.6067 90.8406 141.3622 87.0286 63.6580 92.9741 52.5254 11.8142 87.7584 5.3393 17.7374 107.9343 40.8355 81.3452 1.0085 21.7375 20.6671 133.5609 17.2917 213.9758 22.8905 272.3968 754.8292 219.6423 121.8049 2945.6082 23.1649 4.6969 11.6325 4.8629 0.7035 1.4951 8.2880 0.7190 28.6093 167.2358 28.5902 58.1875
temp: 298.150 k
press: 1.00000 atm
elementType: 8 8 8 8 8 8 8 7 7 7 7 7 6 6 6 6 6 6 6 6 6 6 6 6 6 6 1 1 1 1 1 1 1 1 1 1 1 1 1
symmnumber: 1
zpe: 726328.3 jmol-1
zpe.correction: 0.276644 hartree
zpe.thermalcorrener: 0.298524 hartree
zpe.thermalcorrenthalpy: 0.299468 hartree
zpe.thermalcorrgfe: 0.225692 hartree
zpe.sumelectzpe: -1339.709719 hartree
zpe.sumelectthermal: -1339.687839 hartree
zpe.sumelectthermalent: -1339.686895 hartree
zpe.sumelectthermalfe: -1339.760671 hartree
dipole: -4.1141 -2.4176 0.0297
dipole: 4.7719
quadrupole: -118.2841 -159.2715 -147.0724
quadrupole: 4.1552 -2.3659 0.6034
quadrupole: 23.2586 -17.7289 -5.5297 4.1552 -2.3659 0.6034
hfenergy: -1339.9863624 hartree
pointgroup: C01 [X(C14H13N5O7)]
dipole: -1.6292606 0.9224029 -0.1391756 debye
polarizability: 286.7776747|-2.6085707|214.0154313|5.944141|-2.5096261|124.1076968 unknown
InChI: InChI=1S/C14H13N5O7/c15-10-7-11(17-3-16-10)19(4-18-7)12-8(22)9-5(25-12)1-14(26-9,13(23)24)2-6(20)21/h1,3-4,8-9,12,20,22-23H,2,15H2
charge 0 multiplicity 1
39 atoms
O  2.860312 0.688576 -0.870862
O  0.161042 1.35584 1.387103
O  0.299881 2.830494 -1.923049
O  5.249409 -1.052451 1.315277
O  5.261975 1.119758 0.49083
O  0.810771 -1.409302 -1.132893
O  1.221007 -3.150049 0.341458
N  -1.845598 1.374174 0.049636
N  -4.133334 1.439525 0.310235
N  -1.64314 -1.089888 -0.496966
N  -3.802585 -2.236404 -0.464026
N  -5.821423 -1.095435 -0.026948
C  1.836117 1.576002 -0.326792
C  0.468393 1.669478 -1.055805
C  -0.502082 1.91791 0.144275
C  1.433752 0.934511 0.97541
C  3.233879 -0.30475 0.186752
C  2.246633 -0.076063 1.345273
C  3.092625 -1.73907 -0.407892
C  4.675644 0.03088 0.632638
C  -2.305629 0.063542 -0.181711
C  -2.997735 2.141966 0.347017
C  -3.715291 0.135742 -0.013252
C  1.63001 -2.191929 -0.367934
C  -4.466983 -1.065715 -0.168069
C  -2.456149 -2.189639 -0.610237
H  2.253421 2.597673 -0.208259
H  0.276879 0.714995 -1.575492
H  -0.604788 3.008373 0.282686
H  2.1536 -0.770071 2.178773
H  3.458737 -1.703272 -1.449368
H  3.695407 -2.45313 0.172545
H  0.791801 2.6814 -2.768276
H  -2.921704 3.204171 0.571307
H  6.145247 -0.786483 1.658603
H  -1.949593 -3.131343 -0.839207
H  -0.229675 -1.374202 -0.832445
H  -6.328022 -0.240816 0.198108
H  -6.311307 -1.981698 -0.137645
