program: Gaussian 09
title: 000127136
version: EM64L-G09RevD.01
frameworkgroup: C1[X(C21H23N2S)]
method: RPBEPBE
basis: SDD
operation: Freq
keyword: #p
keyword: freq=noraman
keyword: PBEPBE/SDD
title: #p freq=noraman PBEPBE/SDD
converged: YES YES NO NO
title: Mulliken charges:
elementType: S N N C C C C C C C C C C C C C C C C C C C C C H H H H H H H H H H H H H H H H H H H H H H H
charge: 0.284275 -0.201679 -0.134603 0.611065 -0.394636 -0.006864 -0.359813 -0.339506 -0.270933 -0.646910 -0.251104 -0.213683 -0.229680 -0.149395 0.406989 0.529429 -0.336488 -0.349532 -0.214126 -0.390493 -0.397523 -0.312533 -0.640710 -0.639032 0.246463 0.241666 0.255094 0.262429 0.237682 0.244810 0.243145 0.247867 0.251865 0.255477 0.225764 0.254280 0.257412 0.229979 0.241020 0.230019 0.234316 0.238287 0.252641 0.252477 0.253674 0.253741 0.237377
chargesum: 1.00000
title: Mulliken charges with hydrogens summed into heavy atoms:
elementType: S N N C C C C C C C C C C C C C C C C C C C C C
charge: 0.284275 -0.201679 -0.134603 0.611065 0.093493 -0.006864 -0.359813 -0.084412 -0.008504 0.078727 -0.003237 0.038182 0.025797 0.076369 0.406989 0.529429 -0.082208 -0.092120 0.015893 -0.160514 -0.156503 -0.078216 0.102694 0.105761
polarizability: 1.10941676e+03 -7.42425135e+00 2.45755221e+02 -3.54538058e+00 -8.86295329e+00 1.16054608e+02
1716.lowfreq: -5.0407 -0.0020 -0.0017 0.0010 1.0161 3.3962 20.1968 23.3070 25.9133
frequency: 19.8750 23.2414 25.8427 48.0107 67.1407 70.4944 84.0687 86.4336 102.6972 132.5422 151.8895 162.1791 173.2780 182.9270 204.4474 207.6350 210.7245 240.0187 270.4375 286.0262 313.2177 323.9603 352.9918 395.3671 401.4252 409.5715 435.0371 437.0641 451.8829 454.2715 490.6124 494.4091 519.8967 528.3643 530.9980 551.7108 601.6681 611.8378 628.9381 676.8305 685.2824 718.6680 722.3763 744.9010 760.7133 773.0312 803.7278 818.8807 825.6861 835.4217 846.2034 855.2593 898.2214 909.5190 932.0431 933.5722 946.8867 964.4472 972.1800 985.4123 993.3638 995.2199 1024.6592 1028.6112 1048.7530 1051.6255 1088.2303 1092.3814 1114.7956 1132.5824 1136.0038 1140.8753 1164.5301 1182.2930 1202.4297 1213.5921 1220.8641 1236.8747 1239.8818 1257.9118 1267.6326 1278.2018 1300.5150 1304.5333 1311.1028 1334.5902 1346.7076 1353.4577 1379.9175 1388.5418 1400.2812 1403.5940 1432.4926 1443.7397 1453.1176 1455.2392 1468.0211 1468.7545 1471.5442 1475.6068 1483.0950 1484.0308 1491.9063 1500.9236 1509.3576 1527.9485 1540.7330 1577.3095 1593.5424 1596.9153 1608.0326 1640.9126 2973.9422 2978.9265 3000.0663 3040.2502 3052.4816 3055.0406 3082.8209 3084.3811 3086.1690 3101.6901 3109.4177 3116.5497 3120.6355 3131.2870 3132.6556 3137.3802 3144.3895 3152.8999 3161.6276 3171.5380 3178.8760 3182.5403 3185.0439
redmass: 4.5459 3.7971 4.8258 5.4165 1.9796 2.8648 3.7355 5.5648 4.3101 1.2026 2.5571 4.2609 1.5083 3.5715 1.1901 2.5409 2.4636 4.0212 3.7014 3.8904 3.0180 3.7669 3.7050 4.1445 3.0870 4.2019 3.0541 3.3872 4.2827 3.8922 5.6877 4.8007 2.7098 4.1213 3.3010 4.1687 5.3275 4.4391 6.5783 4.7423 5.8479 4.9420 3.3114 3.4547 1.3815 1.7557 1.2871 1.6533 1.9212 1.6876 4.0198 1.3606 1.8587 1.3560 2.8923 2.7968 1.3698 1.3277 1.3405 2.9819 1.3363 1.1984 3.0423 4.7141 2.8781 1.5780 1.9453 1.2344 1.3506 1.7779 1.7556 1.4842 1.6750 1.0924 1.3947 1.7867 1.7271 1.9044 1.8432 1.5766 1.6841 1.5661 1.7400 1.8498 1.7396 1.4282 1.3640 1.9930 2.9517 2.9626 5.8423 1.2717 1.1579 2.2102 1.4700 2.4748 1.0405 1.3375 1.5838 1.4947 1.0614 1.0457 2.0541 1.1909 1.1523 5.3147 3.0901 4.4280 6.1494 6.6666 5.5200 6.0549 1.0363 1.0385 1.0363 1.0612 1.1003 1.1033 1.0907 1.1024 1.0898 1.0996 1.1030 1.0896 1.0985 1.0961 1.0904 1.0885 1.0886 1.0869 1.0903 1.0957 1.0938 1.0944 1.1008
irintensity: 0.5124 0.5953 0.3347 0.1083 0.1098 0.0851 0.1675 0.2464 1.4285 3.0474 0.2304 0.1991 0.1160 0.0280 0.2345 0.1626 0.1982 3.9345 0.1099 0.4499 4.2584 0.8386 5.9614 1.8341 3.6565 4.5299 2.7247 3.3864 6.3832 6.9690 6.4077 18.2495 14.7705 4.6503 6.5236 20.1607 2.0629 1.8852 2.3409 6.9240 25.0463 44.2734 6.6499 0.1120 95.4646 50.9111 0.1902 1.5781 5.4297 85.0777 50.2542 0.8325 4.5197 0.9362 15.5680 27.5651 1.1868 13.2733 2.0637 1.0161 0.4504 74.8887 12.0718 21.6755 2.0831 21.3797 32.6651 0.3633 0.7071 19.9817 38.8774 16.6141 18.2974 40.5892 628.2479 50.3263 8.0969 89.6443 38.3639 533.2399 66.5681 31.5199 33.2664 18.6886 107.4483 47.0731 37.7763 9.1366 1.2300 587.8911 7.9989 16.3158 36.7043 388.2863 176.5107 106.2205 3.4915 346.1098 177.4371 235.0524 39.2359 33.9924 70.5481 382.6557 246.7215 36.4990 6.8799 3048.6357 476.3102 215.8404 0.0621 101.4053 44.2123 195.0411 10.5313 25.9555 0.1201 42.8510 2.4875 0.4964 4.5958 23.5911 18.3714 7.7952 2.8029 33.7183 7.5781 4.5170 3.1683 1.5340 1.4812 5.1775 10.6689 19.6208 13.6480
temp: 298.150 k
press: 1.00000 atm
elementType: 16 7 7 6 6 6 6 6 6 6 6 6 6 6 6 6 6 6 6 6 6 6 6 6 1 1 1 1 1 1 1 1 1 1 1 1 1 1 1 1 1 1 1 1 1 1 1
symmnumber: 1
zpe: 1014019.3 jmol-1
zpe.correction: 0.386220 hartree
zpe.thermalcorrener: 0.409656 hartree
zpe.thermalcorrenthalpy: 0.410600 hartree
zpe.thermalcorrgfe: 0.331106 hartree
zpe.sumelectzpe: -1319.667405 hartree
zpe.sumelectthermal: -1319.643968 hartree
zpe.sumelectthermalent: -1319.643024 hartree
zpe.sumelectthermalfe: -1319.722518 hartree
dipole: -3.1730 2.3330 -0.1740
dipole: 3.9422
quadrupole: 55.9786 -115.1447 -156.2459
quadrupole: 3.8926 -1.0166 -3.3166
quadrupole: 127.7826 -43.3407 -84.4419 3.8926 -1.0166 -3.3166
hfenergy: -1320.0536244 hartree
pointgroup: C01 [X(C21H23N2S1)]
dipole: 1.2452496 -0.9244995 -0.0152404 debye
polarizability: 1109.2217998|-10.3298584|246.3611932|12.1298676|2.6803795|115.6435949 unknown
InChI: InChI=1S/C21H23N2S/c1-4-23-19-10-6-7-11-20(19)24-21(23)12-8-5-9-17-13-15-18(16-14-17)22(2)3/h5-16H,4H2,1-3H3
charge 1 multiplicity 1
47 atoms
S  -3.265568 1.634711 -0.058529
N  -3.9058 -0.925203 -0.276822
N  7.699623 -0.212565 0.041813
C  -5.155862 -0.254878 -0.214398
C  -3.819989 -2.407524 -0.38881
C  -2.789994 -0.114326 -0.185695
C  -5.019063 1.154543 -0.108006
C  -6.441999 -0.839756 -0.252522
C  -6.133042 2.006801 -0.048932
C  -3.804627 -3.103846 0.986162
C  -1.446376 -0.548828 -0.181213
C  -7.565284 0.011123 -0.192998
C  -7.417893 1.417935 -0.094163
C  -0.334234 0.309642 -0.129208
C  6.339525 0.017332 0.014043
C  3.487821 0.490655 -0.039945
C  5.398485 -1.076434 -0.043075
C  5.806707 1.356072 0.041931
C  1.015458 -0.121447 -0.115096
C  4.027157 -0.841662 -0.068571
C  4.431477 1.572554 0.01549
C  2.084029 0.785192 -0.062182
C  8.23192 -1.590631 0.003919
C  8.64945 0.917328 0.11401
H  -4.682481 -2.739816 -0.990385
H  -2.9194 -2.656618 -0.973716
H  -6.577876 -1.922656 -0.320096
H  -6.017695 3.091472 0.030021
H  -2.931349 -2.794591 1.585977
H  -3.756441 -4.197941 0.846972
H  -4.716071 -2.873033 1.563791
H  -1.258757 -1.627995 -0.211848
H  -8.567957 -0.426001 -0.221241
H  -8.304628 2.056993 -0.049536
H  -0.508468 1.396922 -0.096632
H  5.759746 -2.1074 -0.064931
H  6.478938 2.21605 0.083106
H  3.351037 -1.702251 -0.110399
H  4.054476 2.602351 0.037395
H  1.211644 -1.201105 -0.147425
H  1.819197 1.853648 -0.03351
H  9.33067 -1.556364 0.018642
H  7.919029 -2.117713 -0.916692
H  7.896121 -2.177495 0.879584
H  8.48407 1.522829 1.024681
H  8.559748 1.576495 -0.769957
H  9.677023 0.527729 0.145894
