program: Gaussian 09
title: 000127091
version: EM64L-G09RevD.01
frameworkgroup: C1[X(C6H7N5O2)]
method: RPBEPBE
basis: SDD
operation: Freq
keyword: #pfreq=noraman
keyword: PBEPBE/SDD
title: #p freq=noraman PBEPBE/SDD
converged: NO YES NO NO
title: Mulliken charges:
elementType: O O N N N N N C C C C C C H H H H H H H
charge: -0.235699 -0.249072 -0.422892 -0.453385 -0.408038 -0.038929 -0.382174 0.318733 0.095684 0.219084 0.121513 0.005129 -0.582713 0.307530 0.331622 0.352738 0.295664 0.203316 0.260747 0.261142
chargesum: 0.00000
title: Mulliken charges with hydrogens summed into heavy atoms:
elementType: O O N N N N N C C C C C C
charge: -0.235699 -0.249072 -0.115361 -0.121762 -0.055301 -0.038929 -0.086509 0.318733 0.095684 0.219084 0.121513 0.005129 0.142491
polarizability: 1.62941600e+02 -6.43233752e-01 1.17617409e+02 1.02858595e-02 -9.98486668e-04 4.74444193e+01
1716.lowfreq: -100.5315 -2.4822 -0.8511 -0.0006 0.0004 0.0008 6.3991 66.6390 120.0710
frequency: -100.4831 66.6261 120.0671 132.2983 169.2958 195.0493 210.8781 231.8788 261.8452 329.4681 354.7139 427.5037 441.0681 491.5180 503.4615 528.4149 596.8263 597.1839 630.3604 676.2438 685.7415 702.8982 727.4685 746.7485 828.5839 921.6031 935.7857 1045.1077 1079.4641 1128.7813 1142.6365 1185.0535 1225.2396 1252.7746 1267.8503 1278.3507 1364.2758 1407.8879 1435.5213 1448.9084 1479.3745 1503.3235 1544.7621 1570.5638 1621.5191 1655.7908 1709.3916 2997.6627 3083.7802 3113.5417 3553.5718 3587.5704 3615.4695 3618.7424
redmass: 1.0502 4.5580 2.0857 4.2639 3.7685 1.9071 5.5535 8.1846 6.1653 6.8144 6.0950 8.0252 1.2205 8.1179 1.2995 4.9585 9.2199 1.2855 3.1166 9.4950 6.1679 12.1539 5.6169 11.1918 5.8397 6.0463 3.8488 2.6365 6.0415 1.2788 4.3544 2.2002 1.8969 2.4595 2.9320 1.6843 2.0126 4.7433 1.1874 1.0391 1.4190 1.3129 6.4004 4.8853 6.3395 8.3324 8.5384 1.0333 1.1017 1.1023 1.0787 1.0783 1.0813 1.0815
irintensity: 3.7104 0.0697 0.2794 3.6345 0.0467 23.1779 0.6816 9.0607 17.5246 0.3184 2.1639 8.0328 80.2124 0.0808 183.6182 2.7249 5.7968 84.7157 139.4107 2.1302 13.5480 16.5996 34.4686 10.4728 3.6363 5.3707 42.2557 62.0766 6.6079 1.6901 8.2385 15.4415 31.9193 149.7094 11.4490 17.0153 24.1913 25.3352 31.7446 14.2118 57.5302 107.9823 157.2315 428.6880 504.1092 376.9592 684.1554 55.5613 22.6806 22.5648 26.9455 51.3266 90.2511 78.2027
temp: 298.150 k
press: 1.00000 atm
elementType: 8 8 7 7 7 7 7 6 6 6 6 6 6 1 1 1 1 1 1 1
symmnumber: 1
zpe: 379398.3 jmol-1
zpe.correction: 0.144505 hartree
zpe.thermalcorrener: 0.155578 hartree
zpe.thermalcorrenthalpy: 0.156522 hartree
zpe.thermalcorrgfe: 0.107623 hartree
zpe.sumelectzpe: -656.128794 hartree
zpe.sumelectthermal: -656.117721 hartree
zpe.sumelectthermalent: -656.116777 hartree
zpe.sumelectthermalfe: -656.165677 hartree
dipole: 4.7539 -8.6221 0.0023
dipole: 9.8458
quadrupole: -81.8730 -71.4222 -76.4379
quadrupole: -13.9549 0.0046 -0.0095
quadrupole: -5.2953 5.1555 0.1398 -13.9549 0.0046 -0.0095
hfenergy: -656.2732991 hartree
pointgroup: C01 [X(C6H7N5O2)]
dipole: -1.8208469 3.4190218 -0.0036944 debye
dipolederiv: -1.7912217 -0.2126599 0.0027294 -0.1887252 -0.4463701 0.000435 0.0028203 0.0004976 -0.3875065 -0.5319502 0.0949247 0.0000407 -0.0318804 -1.3565499 0.0022027 0.0002947 0.0019446 -0.3842968 -1.1206865 0.2302713 0.0008767 -0.3059566 -0.6468628 0.0014695 0.0019367 0.0008177 -0.2488678 -1.1184634 -0.1954579 0.0017078 0.2817075 -0.4839133 -0.0002164 0.0006683 0.0005217 -0.3370727 -0.9393978 0.0398938 0.0009935 -0.5049949 -0.5102164 0.0012866 0.0020865 0.0003914 -0.3050971 -0.9927686 0.4171508 0.0002263 0.7944647 -1.1385226 0.0007143 -0.000527 0.0011467 -0.2856984 -1.5278888 0.290754 0.001263 0.5672757 -0.4990479 0.0000364 -0.0019361 0.0011918 -0.5207621 0.994134 0.0241982 -0.0015066 0.3620327 0.7659418 -0.0020341 -0.0022741 -0.0014593 0.0957044 0.1612371 -0.5202817 0.0008153 -0.5614472 -0.6392329 0.0022242 0.0009722 0.0021176 -0.0268476 1.8793627 -0.270959 -0.001913 -0.6016259 1.2623029 -0.0017531 -0.0006998 -0.0022845 0.2238827 2.425978 0.2073333 -0.0039597 0.1590641 0.7864343 -0.0013638 -0.0039721 -0.0014749 0.2661034 1.3547945 -0.1219403 -0.0015872 -0.052957 1.8801037 -0.0035543 -0.0016993 -0.0033775 0.2228588 0.5808801 0.0450272 -0.0011978 0.2427699 0.2222057 -0.0014361 -0.0007725 -0.0012437 0.2258484 0.1367494 -0.0144385 0.0004066 -0.0204816 0.1394531 0.0004465 0.0003521 0.0002872 0.3511951 0.1720251 0.0212926 0.000282 0.0482983 0.2308822 0.0002519 0.0002261 0.0003505 0.3757197 0.2151378 -0.0727685 0.0003934 -0.0272695 0.2649282 0.0002624 0.000299 0.0003343 0.3660642 0.1062356 -0.0619773 0.0003783 -0.1068919 0.1099144 0.0003123 0.0011639 -0.000315 0.3443658 -0.096256 0.0813858 -0.0003628 0.1771964 -0.0249376 0.00092 -0.0006369 0.0009783 0.1271548 0.045284 0.0090013 -0.0219605 -0.1154698 0.0423791 0.088657 0.0465854 0.0810415 -0.0526341 0.0468146 0.0092501 0.0223746 -0.1151092 0.0411081 -0.088861 -0.0448874 -0.081466 -0.0501142 unknown
polarizability: 162.9130171|-1.3018825|117.6453453|-0.1904358|-0.1507225|47.4450654 unknown
InChI: InChI=1S/C6H7N5O2/c1-7-5-9-3-2(4(12)11-5)8-6(13)10-3/h7-10H,1H3
charge 0 multiplicity 1
20 atoms
O  4.089568 0.517715 -0.005791
O  -0.341547 -2.731316 0.008552
N  -0.677934 1.41699 0.000077
N  1.841344 1.386066 -0.003953
N  2.091817 -0.836991 0.000403
N  -1.696686 -0.78755 0.006587
N  -3.035005 1.140878 0.004006
C  0.572984 0.814665 -0.000677
C  0.707792 -0.566498 0.002041
C  -1.794015 0.534998 0.003801
C  2.844956 0.346353 -0.003323
C  -0.440252 -1.466438 0.005987
C  -4.261462 0.329577 0.007761
H  -0.787763 2.431332 -0.00157
H  2.104929 2.369151 -0.006678
H  2.49605 -1.771458 0.001764
H  -3.113389 2.156305 0.003422
H  -5.132291 1.005544 0.003843
H  -4.298574 -0.318838 0.900082
H  -4.297421 -0.327685 -0.878033
