program: Gaussian 09
title: 000127089
version: EM64L-G09RevD.01
frameworkgroup: C1[X(C9H9NO2)]
method: RPBEPBE
basis: SDD
operation: Freq
keyword: #pfreq=noraman
keyword: PBEPBE/SDD
title: #p freq=noraman PBEPBE/SDD
converged: NO NO NO NO
title: Mulliken charges:
elementType: O O N C C C C C C C C C H H H H H H H H H
charge: -0.330538 -0.439063 -0.410687 0.316088 0.252508 -0.527668 -0.459491 0.219521 -0.400679 0.164496 -0.239374 -0.523108 0.250764 0.252018 0.252197 0.304346 0.251956 0.377890 0.239925 0.224448 0.224448
chargesum: 0.00000
title: Mulliken charges with hydrogens summed into heavy atoms:
elementType: O O N C C C C C C C C C
charge: -0.330538 -0.061172 -0.106341 0.316088 0.252508 -0.276904 -0.207473 0.219521 -0.148482 0.164496 0.012583 0.165714
polarizability: 1.70278300e+02 -5.03863483e+00 1.15072944e+02 9.38133901e-04 -1.28574850e-03 4.99923201e+01
1716.lowfreq: -5.2880 -0.0008 -0.0005 0.0002 10.7418 11.7335 70.3676 147.9180 149.8768
frequency: 70.0538 147.9176 149.8730 185.7121 237.8755 297.7272 331.7365 354.6791 367.3366 418.7099 448.3963 482.9775 489.6922 499.5446 595.1439 600.4681 670.4947 718.4272 727.4636 746.1121 754.0481 825.6950 831.4681 839.6730 856.9991 891.0533 991.1149 1062.0433 1081.6316 1120.0048 1128.3635 1152.2295 1166.9923 1186.4434 1228.4153 1247.5092 1307.4242 1339.1738 1372.8318 1420.9619 1442.1847 1463.2398 1479.3609 1482.2116 1511.5872 1516.5815 1599.7172 1651.1418 2956.6023 3041.3557 3120.5089 3153.5327 3165.6541 3209.6793 3237.3536 3504.3951 3615.0469
redmass: 3.2024 4.5399 5.4525 3.3768 1.1408 5.0073 5.0910 4.3992 5.9345 2.7642 7.6878 5.7481 1.1077 1.2646 4.1852 2.7502 5.7513 1.6032 6.2159 6.4713 2.0264 3.9491 1.3496 1.6400 1.4707 3.8534 5.7326 1.6153 1.9734 1.2578 2.2718 1.3385 1.7249 2.2384 1.7935 1.4968 2.2021 2.7319 4.7535 2.4819 1.3147 1.0496 1.1098 3.5765 4.5900 4.8946 6.0195 7.6935 1.0330 1.1037 1.0995 1.0913 1.0928 1.0908 1.1062 1.0644 1.0809
irintensity: 9.6507 0.0785 1.4139 2.9119 0.6269 10.7925 1.0007 4.1455 7.0090 10.4357 4.0214 5.2752 101.4812 133.4968 3.2052 5.0828 11.0067 51.8577 9.1454 1.1496 24.6868 67.1304 31.2685 11.3155 48.8277 4.2350 35.0445 20.6914 10.3179 0.1571 100.9844 73.8338 95.9326 17.8736 17.9037 137.8526 30.6878 114.1757 12.4801 101.9736 3.1470 13.8301 30.4104 46.1749 25.2850 30.5029 25.0798 9.8528 62.6916 49.2951 25.0188 10.0117 3.3882 2.6148 4.1713 97.4346 56.3381
temp: 298.150 k
press: 1.00000 atm
elementType: 8 8 7 6 6 6 6 6 6 6 6 6 1 1 1 1 1 1 1 1 1
symmnumber: 1
zpe: 427632.5 jmol-1
zpe.correction: 0.162877 hartree
zpe.thermalcorrener: 0.173104 hartree
zpe.thermalcorrenthalpy: 0.174048 hartree
zpe.thermalcorrgfe: 0.127484 hartree
zpe.sumelectzpe: -552.679484 hartree
zpe.sumelectthermal: -552.669256 hartree
zpe.sumelectthermalent: -552.668312 hartree
zpe.sumelectthermalfe: -552.714876 hartree
dipole: 0.5488 -1.8358 0.0002
dipole: 1.9161
quadrupole: -50.5708 -64.9155 -75.2166
quadrupole: 12.2610 -0.0005 -0.0001
quadrupole: 12.9969 -1.3479 -11.6490 12.2610 -0.0005 -0.0001
hfenergy: -552.8423603 hartree
pointgroup: C01 [X(C9H9N1O2)]
dipole: -0.2572139 -0.7086056 -0.0000832 debye
dipolederiv: -1.4560165 0.4690062 0.0000085 0.5890875 -0.693353 -0.0000135 -0.0000212 -0.000015 -0.3012933 -1.139282 -0.5455665 -0.0000196 -0.7277504 -0.6009183 -0.0000109 -0.0000279 -0.0000093 -0.4138447 -0.4404688 -0.0454479 0.0000119 0.2806008 -0.5154461 -0.0000075 0.0000333 -0.0000278 -0.2799858 0.0330712 0.0061236 -0.0000018 0.323425 -0.1157818 -0.000003 0.0000097 0.0000025 0.0155305 0.4672007 0.0104871 -0.0000074 -0.3636982 -0.0016352 0. -0.0000011 0.0000013 0.0091846 0.036155 0.0535449 0.0000037 -0.0593028 -0.0022142 0.0000047 -0.0000107 0.0000002 -0.2060472 -0.1305986 -0.0877662 0.0000011 0.0933237 0.0076267 0.0000035 -0.0000022 0.0000059 -0.2082955 1.086354 -0.3817532 0.0000009 -0.7175614 -0.0106339 -0.0000206 0.0000245 -0.0000163 0.027058 -0.0572858 0.1755716 0.0000116 0.0392757 -0.0584644 0.0000071 0.0000132 0.0000166 -0.2891636 0.7612148 0.4636225 0.0000203 0.9345284 0.4771005 0.0000198 0.0000383 0.0000125 0.0442311 -0.2945516 -0.0257869 -0.000012 -0.1289667 0.51728 0.000015 -0.0000521 0.000016 -0.1914539 0.397993 -0.1463316 -0.0000082 -0.5259901 0.6397855 0.000012 -0.0000268 0.0000194 0.3387003 0.0823315 0.0365806 -0.0000005 0.0721812 -0.0755307 -0.0000035 -0.0000007 -0.0000019 0.1740551 0.0755047 0.0402915 0. 0.0144626 -0.0588456 -0.0000039 -0.000001 -0.000005 0.1926478 0.0777136 -0.0190452 -0.0000017 -0.0688088 -0.0586004 -0.0000075 -0.0000041 -0.0000111 0.2008278 0.2005585 -0.0334062 -0.000003 -0.0371443 0.1617664 -0.0000019 -0.0000128 0.0000065 0.3467713 -0.0595407 -0.0114085 0.0000019 0.0070773 0.1004162 -0.0000029 0.0000191 -0.0000021 0.2214066 0.3678664 0.1361957 0.0000035 0.0852684 0.3240502 0.0000015 0.0000068 0.0000003 0.3772189 -0.1665896 0.0514647 0.0000075 0.0037944 0.0760185 -0.0000015 0.0000056 -0.0000018 0.1236289 0.0791841 -0.073184 -0.098465 0.0930992 -0.0562947 -0.0729778 -0.0299148 -0.1024746 -0.0905986 0.0791861 -0.0731922 0.0984482 0.0930985 -0.0563256 0.072991 0.029925 0.1024835 -0.0905784 unknown
polarizability: 170.6749422|1.8258568|114.6763017|0.0010107|0.0012295|49.9923201 unknown
InChI: InChI=1S/C9H9NO2/c1-12-9-4-6-2-3-10-7(6)5-8(9)11/h2-5,10-11H,1H3
charge 0 multiplicity 1
21 atoms
O  2.71593 -0.507522 0.000086
O  2.10921 2.070174 0.000112
N  -2.699977 0.826987 0.000046
C  -1.046391 -0.750601 0.000027
C  -1.308698 0.66522 0.000051
C  0.302414 -1.207924 0.00003
C  -0.278018 1.634169 0.00007
C  1.324256 -0.249439 0.000061
C  -2.330088 -1.422225 0.000006
C  1.040632 1.160875 0.00008
C  -3.315719 -0.435796 0.000005
C  3.139107 -1.901873 -0.00003
H  0.525838 -2.27927 0.000016
H  -0.461103 2.712349 0.000085
H  -2.507064 -2.496443 -0.000026
H  -3.186148 1.72044 0.000037
H  -4.400003 -0.531834 0.000014
H  2.954993 1.546674 0.000106
H  4.239268 -1.882288 -0.000052
H  2.774009 -2.428517 -0.90395
H  2.77405 -2.428657 0.903824
