program: Gaussian 09
title: 000127083
version: EM64L-G09RevD.01
frameworkgroup: C1[X(C16H12N4O2S2)]
method: RPBEPBE
basis: SDD
operation: Freq
keyword: #p
keyword: freq=noraman
keyword: PBEPBE/SDD
title: #p freq=noraman PBEPBE/SDD
converged: YES YES NO NO
title: Mulliken charges:
elementType: S S O O N N N N C C C C C C C C C C C C C C C C H H H H H H H H H H H H
charge: 0.332898 0.371114 -0.245131 -0.250014 -0.310019 -0.069273 -0.043553 0.022280 0.768694 -0.163497 -0.055491 -0.409510 -0.671661 0.328841 0.211847 -0.351842 -0.383955 -0.638880 -0.231676 -0.228768 0.170508 -0.235164 -0.222932 -0.670022 0.308499 0.260013 0.272712 0.304811 0.228984 0.229595 0.230583 0.231659 0.231734 0.211538 0.232553 0.232526
chargesum: 0.00000
title: Mulliken charges with hydrogens summed into heavy atoms:
elementType: S S O O N N N N C C C C C C C C C C C C C C C C
charge: 0.332898 0.371114 -0.245131 -0.250014 -0.310019 -0.069273 -0.043553 0.022280 0.768694 -0.163497 -0.055491 -0.409510 -0.363162 0.328841 0.211847 -0.091829 -0.111243 -0.334070 -0.002692 0.000827 0.170508 -0.004581 0.240461 0.006595
polarizability: 4.17160831e+02 -1.59464268e+01 2.86909298e+02 3.55443277e-01 7.81095675e-02 9.77257416e+01
1716.lowfreq: -8.1491 -5.5351 -0.6595 -0.0020 -0.0017 -0.0014 10.8665 29.7026 35.4331
frequency: 10.1215 29.6661 35.4329 37.6447 61.4879 66.2835 70.1396 80.2484 111.6746 123.7229 180.0054 185.7319 189.2438 237.6174 254.7818 255.7712 265.9922 280.6725 288.2580 310.0265 312.2598 364.2148 397.5264 403.8807 488.9163 497.1825 501.6408 517.5526 553.9765 579.0434 585.9596 614.6883 621.6589 656.1062 678.3062 686.2196 700.2404 707.5079 730.3063 735.5533 752.5242 754.3592 788.0269 792.2607 798.5552 833.1546 833.2497 861.8512 864.5504 912.8661 933.4081 944.7788 989.1504 991.5582 1004.5888 1018.1609 1020.5997 1024.1641 1069.2709 1076.6500 1095.0222 1112.9170 1133.6945 1156.0366 1173.0676 1179.8860 1185.7460 1190.3368 1217.1439 1239.5569 1248.4443 1312.3534 1322.3650 1357.9386 1379.3967 1388.8083 1400.0709 1422.6592 1431.5972 1444.0731 1461.9576 1470.3986 1474.5967 1486.2568 1492.6953 1515.9196 1575.4520 1588.2920 1606.9016 1618.6336 2997.0682 3010.3700 3069.7872 3093.7261 3109.7641 3128.0541 3138.8237 3152.3693 3162.3035 3171.5192 3246.5189 3262.0823
redmass: 4.3958 3.9816 6.0148 3.9030 5.4218 5.1500 7.0656 5.2503 3.7583 6.2223 5.4094 5.6691 3.7741 3.0869 10.0915 2.1071 8.7881 6.3988 9.4849 5.7217 7.1859 5.0786 6.4012 2.8393 4.6466 4.9298 9.2152 11.5114 12.5095 5.3166 11.7067 6.4654 7.8038 9.0767 6.9190 8.4267 2.3359 3.0611 3.8180 8.2898 7.6531 1.5231 2.1139 4.7034 1.1022 1.4968 4.0332 1.2481 5.3565 11.7010 6.5608 1.4348 6.2510 1.3809 1.3276 2.5237 2.5985 4.4048 2.2152 1.7271 3.1591 2.2546 1.4605 1.9442 1.0565 3.4897 1.1546 3.2358 5.4885 6.9440 1.1372 4.3627 1.3983 1.5902 7.5153 8.2709 1.2716 9.9849 3.2717 2.4818 1.0400 1.5328 2.1832 1.1615 7.9719 4.3554 9.9886 6.3417 11.8744 6.1196 1.0359 1.0580 1.1068 1.0985 1.1025 1.0851 1.0887 1.0933 1.0964 1.1004 1.0954 1.0966
irintensity: 0.1784 0.2483 0.0210 0.1067 0.5721 0.1693 3.3276 4.0359 1.1100 4.6538 0.1532 2.5552 0.1756 0.4382 4.1923 2.0224 5.3736 0.3126 1.9740 6.2104 1.1944 8.7521 2.3047 0.0001 2.7593 0.5018 7.1326 2.1251 0.5970 0.1864 11.6205 0.0286 9.7117 3.3727 13.4848 28.7110 25.6300 50.0170 11.4059 22.2290 17.9687 43.6058 39.0873 11.8489 2.4357 39.4777 4.8996 0.0052 9.7245 2.4269 67.4136 5.9530 0.0233 0.0399 0.6769 44.0427 25.8248 22.5794 91.2614 18.3434 5.8275 5.4368 6.0323 66.0436 0.0998 0.7565 47.2405 420.5460 8.3438 24.7169 0.0042 53.4988 12.1160 2.1536 37.8682 3.0167 23.6482 213.6562 116.1984 18.4081 12.2010 44.4148 23.8575 29.0932 17.1705 15.7721 8.7167 0.5511 255.2619 1.2953 20.0643 22.0427 8.4510 32.5257 41.6413 0.3855 10.6028 23.4558 15.5367 21.6526 12.3698 23.2214
temp: 298.150 k
press: 1.00000 atm
elementType: 16 16 8 8 7 7 7 7 6 6 6 6 6 6 6 6 6 6 6 6 6 6 6 6 1 1 1 1 1 1 1 1 1 1 1 1
symmnumber: 1
zpe: 663303.0 jmol-1
zpe.correction: 0.252639 hartree
zpe.thermalcorrener: 0.273859 hartree
zpe.thermalcorrenthalpy: 0.274803 hartree
zpe.thermalcorrgfe: 0.198579 hartree
zpe.sumelectzpe: -1780.766662 hartree
zpe.sumelectthermal: -1780.745443 hartree
zpe.sumelectthermalent: -1780.744498 hartree
zpe.sumelectthermalfe: -1780.820722 hartree
dipole: -1.2612 0.9093 0.0184
dipole: 1.5549
quadrupole: -132.1090 -146.2289 -156.5127
quadrupole: -17.6240 -0.1029 -0.0699
quadrupole: 12.8412 -1.2787 -11.5625 -17.6240 -0.1029 -0.0699
hfenergy: -1781.0193012 hartree
pointgroup: C01 [X(C16H12N4O2S2)]
dipole: -0.4954119 -0.3560784 -0.0447476 debye
polarizability: 416.8902981|15.4689188|286.0612393|9.7396768|12.8882459|98.8443333 unknown
InChI: InChI=1S/C16H12N4O2S2/c1-2-22-15(21)11-8-23-14(17-11)12-9-24-16-18-13(19-20(12)16)10-6-4-3-5-7-10/h3-9H,2H2,1H3
charge 0 multiplicity 1
36 atoms
S  0.55541 -3.609208 -0.386508
S  -0.837328 1.740532 -0.060652
O  -5.52057 0.021327 -0.344356
O  -5.461906 2.3496 -0.166472
N  0.889949 -1.006744 -0.206503
N  1.737057 0.093871 -0.114763
N  2.94689 -1.919686 -0.215289
N  -2.744364 -0.141669 -0.255451
C  -0.509255 -1.142332 -0.252368
C  1.634606 -2.183282 -0.264865
C  2.978265 -0.514318 -0.124049
C  -1.425651 -0.01887 -0.203733
C  -0.865277 -2.477185 -0.350015
C  4.229379 0.249077 -0.046054
C  -3.391406 1.094219 -0.189264
C  4.209058 1.667554 0.042675
C  5.472969 -0.43646 -0.060356
C  -2.552146 2.202478 -0.082927
C  5.418985 2.386616 0.115605
C  6.679787 0.289455 0.012929
C  -4.871051 1.240477 -0.229205
C  6.658178 1.701631 0.101075
C  -7.016329 0.089931 -0.393304
C  -7.511955 -1.345263 -0.528491
H  -1.877285 -2.869198 -0.402617
H  3.246801 2.18979 0.053148
H  5.471674 -1.528687 -0.128916
H  -2.863015 3.243272 -0.019694
H  5.398387 3.479885 0.183489
H  7.636436 -0.244236 0.001418
H  7.597143 2.263505 0.157789
H  -7.37055 0.579203 0.532073
H  -7.305302 0.72457 -1.25063
H  -8.616416 -1.356394 -0.569614
H  -7.124096 -1.810165 -1.450691
H  -7.188973 -1.955994 0.331588
