program: Gaussian 09
title: 000127087
version: EM64L-G09RevD.01
frameworkgroup: C1[X(C21H28N2O3)]
method: RPBEPBE
basis: SDD
operation: Freq
keyword: #p
keyword: freq=noraman
keyword: PBEPBE/SDD
title: #p freq=noraman PBEPBE/SDD
converged: YES YES NO NO
title: Mulliken charges:
elementType: O O O N N C C C C C C C C C C C C C C C C C C C C C H H H H H H H H H H H H H H H H H H H H H H H H H H H H
charge: -0.259899 -0.286085 -0.225843 -0.122932 -0.061797 -0.381153 -0.364511 -0.373832 -0.383177 -0.406699 -0.517644 -0.318180 0.376832 -0.188200 -0.330668 0.085243 0.314249 0.359669 -0.546060 -0.695587 -0.379357 -0.329541 -0.339105 -0.377874 0.201168 -0.768482 0.198357 0.201974 0.195271 0.192661 0.193768 0.191531 0.208486 0.231143 0.216503 0.218080 0.228428 0.230244 0.209298 0.208262 0.239211 0.223961 0.223900 0.267212 0.223366 0.239194 0.208217 0.269493 0.269019 0.249630 0.251938 0.230363 0.249895 0.250060
chargesum: 0.00000
title: Mulliken charges with hydrogens summed into heavy atoms:
elementType: O O O N N C C C C C C C C C C C C C C C C C C C C C
charge: -0.259899 -0.286085 -0.225843 -0.122932 -0.061797 0.019178 0.023421 0.011467 0.056451 0.027885 -0.058973 0.099380 0.376832 0.051011 0.117193 0.085243 0.314249 0.359669 -0.278848 -0.024809 -0.109864 -0.060523 -0.089474 -0.125936 0.201168 -0.038164
polarizability: 4.23897157e+02 2.66263350e+01 2.13455349e+02 -5.59331793e+00 8.02622087e+00 1.65381312e+02
1716.lowfreq: -115.9915 -8.7809 -1.8576 -0.0012 -0.0006 0.0015 5.0584 7.8059 13.6403
frequency: -115.9892 6.8025 13.1292 14.2034 23.2286 39.7676 42.0366 46.7027 60.0420 73.8548 79.7100 87.6706 104.3486 119.2963 122.1003 128.9391 141.2426 152.8813 174.8004 196.0734 237.4094 244.2896 245.4871 283.0300 297.5238 326.8321 340.9171 351.9657 383.3481 412.9548 415.8193 437.7871 455.1745 470.5090 508.6332 519.6403 591.9295 624.8775 627.4659 633.1271 647.0610 669.5940 685.7196 723.5872 732.8497 738.1168 740.6512 768.8950 791.9344 810.4385 820.2789 823.1865 831.1867 839.0628 849.1006 849.4650 884.1259 902.6597 918.9318 922.2556 941.8697 961.9457 969.0255 971.4631 982.1341 988.3040 991.7167 998.3754 1008.8116 1011.8175 1016.6056 1046.7649 1051.1292 1067.3221 1069.1401 1079.6402 1085.1061 1104.0872 1106.2817 1117.0012 1126.5206 1137.7318 1149.0890 1175.4608 1178.7113 1199.6762 1216.4653 1226.1383 1232.9647 1252.6138 1261.6063 1264.9599 1281.7866 1288.4038 1288.6091 1294.6490 1300.3252 1301.3133 1302.2826 1321.5216 1326.7968 1333.4325 1353.7506 1359.9779 1371.8513 1384.6337 1388.1054 1389.3142 1403.0831 1426.3286 1437.6515 1455.2321 1462.4679 1462.6001 1464.2835 1464.7674 1468.4972 1474.6588 1474.9391 1482.7423 1483.5143 1483.9148 1488.7317 1498.3849 1573.2785 1587.6368 1612.4469 1625.4802 2947.0690 2951.8051 2954.5343 2964.7665 2979.0687 2983.8277 2988.2518 2990.5138 2994.6678 2997.0201 2999.7260 3000.8165 3005.8046 3020.0911 3027.7249 3038.8512 3062.1471 3064.4603 3080.4612 3085.3144 3090.2278 3099.3166 3107.7224 3150.6198 3157.1585 3169.9814 3178.6808 3237.5206
redmass: 1.0500 4.9148 5.2123 4.1064 4.4113 3.0794 4.5860 3.4608 2.3673 3.1057 3.4574 5.0868 2.8745 5.0085 2.1523 4.4337 2.2764 2.1110 4.3798 3.6934 1.6148 2.2638 2.4352 3.6112 4.4738 4.1264 3.1581 4.7891 3.3506 3.7993 3.0912 3.5958 3.8583 3.8383 3.5642 3.0763 4.9856 4.8965 6.6741 6.4003 5.2683 3.7604 3.9704 1.0773 2.0145 4.1710 1.5578 1.2104 6.6131 2.2730 4.9514 1.6670 1.4325 1.3749 2.6365 2.3833 2.7935 1.3902 3.3431 1.5685 4.4384 7.1759 2.6341 1.3505 1.3472 5.4569 1.3522 3.4174 2.3656 3.9017 2.6215 1.4998 3.4969 2.2269 2.7492 2.1972 1.4886 3.3599 1.8485 1.3249 1.7048 1.7484 1.3834 1.2303 1.3056 1.7694 1.2776 2.9231 1.6626 1.9555 1.3318 1.3855 1.0554 1.1899 1.3883 1.1054 1.1615 1.2823 1.2754 1.7294 1.4861 1.3738 1.4905 1.6298 3.3242 1.7143 1.2426 3.8096 1.2383 4.1534 5.0591 1.1536 1.0720 1.0472 1.0784 1.0438 1.0865 1.0781 1.0964 1.1415 1.0862 1.1685 1.1547 2.0991 7.5417 7.3589 9.5132 6.6681 1.0551 1.0589 1.0587 1.0592 1.0620 1.0358 1.0718 1.0858 1.0592 1.0850 1.0368 1.1002 1.1064 1.0587 1.1028 1.1014 1.1045 1.1038 1.1003 1.0984 1.1082 1.1014 1.0997 1.0878 1.0882 1.0962 1.0973 1.0996
irintensity: 0.9488 0.3365 1.6081 2.8560 0.7530 0.4593 0.5234 1.9939 0.5298 0.2836 0.2480 1.1681 0.4279 0.6454 0.4678 0.2349 0.1823 0.7413 9.3606 1.7422 0.6529 2.5692 1.3109 0.7749 1.5809 0.8551 1.1705 2.1211 0.6630 3.0017 0.4493 1.4862 3.3777 4.3248 3.4902 5.1656 0.8088 6.1316 1.5687 27.4103 22.8002 5.0650 4.6741 12.3709 1.9802 3.5504 1.4703 1.9060 16.6985 12.9980 2.4197 6.5290 18.7681 10.9391 43.3731 49.3428 2.0353 1.3587 41.6448 17.5399 11.2116 106.7108 8.1915 1.5856 0.2279 92.1858 0.7119 18.0147 1.0749 7.2626 30.0244 8.3992 7.2967 16.9956 1.3299 0.8072 4.7522 3.4241 14.9360 16.5486 3.9791 2.2710 0.6275 176.9764 3.8435 2.4457 29.2043 253.9316 7.1892 52.6641 2.3722 0.3745 0.5690 1.0339 49.5006 0.0314 0.0826 2.1167 1.7586 37.9195 67.0946 0.8646 0.7763 0.2684 14.4073 64.4685 13.8600 38.2200 23.5586 0.8148 12.8371 4.1950 1.2196 8.9805 0.4070 15.6834 7.8077 31.0042 7.9112 28.3778 3.3256 14.3799 65.9922 105.8839 0.5103 89.3792 68.7799 304.1769 24.3054 4.4264 16.4431 63.8654 0.4401 34.1756 34.7967 21.8926 40.3056 27.3415 19.9335 0.9715 23.6210 64.6821 20.3472 14.7060 6.6284 143.0821 41.9395 11.9762 31.0173 33.3084 14.4301 6.8483 3.8842 12.6313 3.4901 0.8322
temp: 298.150 k
press: 1.00000 atm
elementType: 8 8 8 7 7 6 6 6 6 6 6 6 6 6 6 6 6 6 6 6 6 6 6 6 6 6 1 1 1 1 1 1 1 1 1 1 1 1 1 1 1 1 1 1 1 1 1 1 1 1 1 1 1 1
symmnumber: 1
zpe: 1180837.9 jmol-1
zpe.correction: 0.449757 hartree
zpe.thermalcorrener: 0.476172 hartree
zpe.thermalcorrenthalpy: 0.477116 hartree
zpe.thermalcorrgfe: 0.386036 hartree
zpe.sumelectzpe: -1150.193752 hartree
zpe.sumelectthermal: -1150.167338 hartree
zpe.sumelectthermalent: -1150.166394 hartree
zpe.sumelectthermalfe: -1150.257474 hartree
dipole: -0.0137 -2.1930 -3.0952
dipole: 3.7933
quadrupole: -134.6198 -156.5684 -159.5155
quadrupole: -12.1873 -31.1596 -1.2049
quadrupole: 15.6147 -6.3338 -9.2809 -12.1873 -31.1596 -1.2049
hfenergy: -1150.6435095 hartree
pointgroup: C01 [X(C21H28N2O3)]
dipole: 0.0246958 0.1388067 1.485744 debye
polarizability: 423.1118174|-28.8322069|186.1491772|10.0513065|-24.9077173|193.4728232 unknown
InChI: InChI=1S/C21H28N2O3/c1-16-14-20(26-23-16)8-6-4-3-5-7-13-24-19-11-9-18(10-12-19)21-22-17(2)15-25-21/h9-12,14,17H,3-8,13,15H2,1-2H3
charge 0 multiplicity 1
54 atoms
O  1.69901 0.746316 -0.734233
O  8.133685 0.748084 -0.811756
O  -8.617857 -0.583109 -0.869215
N  7.880612 -0.865561 0.857359
N  -9.986859 -0.095933 -1.120272
C  -3.221947 0.216931 -0.120256
C  -4.37569 -0.499014 0.616764
C  -1.8236 -0.261665 0.33108
C  -5.769079 -0.017422 0.158064
C  -0.679498 0.463281 -0.41396
C  -6.917885 -0.740896 0.914582
C  0.70009 -0.012086 0.045409
C  -8.285236 -0.31965 0.467273
C  9.365452 -0.723019 0.677513
C  9.533302 0.35919 -0.447617
C  7.292019 -0.05045 0.018801
C  5.84752 0.142748 -0.166474
C  3.054606 0.494376 -0.494546
C  -9.360098 0.305305 1.078504
C  10.005143 -2.07959 0.329454
C  4.931959 -0.612775 0.609325
C  5.346175 1.07927 -1.112637
C  3.542853 -0.44472 0.453204
C  3.962841 1.254137 -1.275958
C  -10.383177 0.422144 0.068594
C  -11.757956 1.025509 0.200314
H  -3.304439 1.311412 0.042962
H  -3.328982 0.055997 -1.212735
H  -4.292801 -1.59387 0.452485
H  -4.269191 -0.337815 1.710236
H  -1.742127 -1.356433 0.166046
H  -1.718467 -0.100639 1.424567
H  -5.859235 1.075453 0.317362
H  -5.889126 -0.191307 -0.928203
H  -0.753401 1.555512 -0.250603
H  -0.770565 0.29442 -1.503976
H  -6.805296 -1.834257 0.771297
H  -6.831788 -0.547529 1.999736
H  0.831037 -1.098356 -0.142148
H  0.849293 0.183017 1.128002
H  9.787487 -0.362363 1.635267
H  10.014267 -0.03992 -1.357572
H  10.05257 1.271529 -0.111273
H  -9.425233 0.64051 2.110771
H  9.607828 -2.463607 -0.627496
H  9.777875 -2.819681 1.115596
H  11.103982 -1.986646 0.243837
H  5.328997 -1.330564 1.334236
H  6.051826 1.662271 -1.711217
H  2.858559 -1.04032 1.064054
H  3.55956 1.969934 -1.998396
H  -11.920032 1.400231 1.223868
H  -12.540774 0.280228 -0.024392
H  -11.890109 1.866692 -0.502328
