program: Gaussian 09
title: 000127113
version: EM64L-G09RevD.01
frameworkgroup: C1[X(C20H26O5)]
method: RPBEPBE
basis: SDD
operation: Freq
keyword: #pfreq=noraman
keyword: PBEPBE/SDD
title: #p freq=noraman PBEPBE/SDD
converged: YES YES NO NO
title: Mulliken charges:
elementType: O O O O O C C C C C C C C C C C C C C C C C C C C H H H H H H H H H H H H H H H H H H H H H H H H H H
charge: -0.439558 -0.202874 -0.222678 -0.439880 -0.227678 -0.104890 0.261404 -0.151887 -0.170353 -0.231794 -0.602158 -0.142373 -0.518806 -0.249079 -0.476839 -0.487351 -0.638344 0.531401 -0.097744 -0.497736 0.080796 -0.536256 -0.551328 0.174917 -0.382675 0.213941 0.284489 0.242006 0.235777 0.219390 0.244233 0.212078 0.201288 0.273284 0.228913 0.278936 0.211621 0.236399 0.221217 0.226622 0.234095 0.184889 0.218005 0.229464 0.351173 0.231112 0.250502 0.259996 0.234787 0.230485 0.369062
chargesum: 0.00000
title: Mulliken charges with hydrogens summed into heavy atoms:
elementType: O O O O O C C C C C C C C C C C C C C C C C C C C
charge: -0.088384 -0.202874 -0.222678 -0.070818 -0.227678 0.109051 0.261404 0.132602 0.071654 0.003982 -0.138535 0.069705 -0.044233 -0.020165 0.013718 -0.029736 -0.177628 0.531401 0.087145 -0.050268 0.080796 -0.054642 -0.291331 0.174917 0.082597
polarizability: 2.85904185e+02 -5.22493796e+00 2.09587713e+02 -1.50368779e+01 6.96957457e+00 1.76073557e+02
1716.lowfreq: -8.4893 -0.0008 0.0002 0.0006 1.7953 8.6500 26.8553 32.0520 45.8966
frequency: 26.6585 31.9691 45.8511 62.0780 71.4902 100.9282 115.8990 118.6382 130.9170 152.5064 159.9621 167.1359 194.9057 204.8140 212.9517 232.8791 253.0783 266.9990 268.5093 301.5369 316.7427 325.9493 342.8126 350.2720 370.2122 388.3714 393.4385 403.6032 432.0528 443.8952 456.6561 484.7156 507.3746 516.8694 540.8765 568.1249 592.2838 608.3374 618.7075 635.8070 671.7084 711.3591 736.6054 761.4310 764.0764 798.8650 824.5357 842.7694 854.3300 862.9124 864.6939 893.5553 899.7512 911.1815 916.5186 924.8838 951.3576 967.1280 976.3553 983.0457 992.9970 1000.4069 1010.2057 1015.7738 1030.0593 1041.9415 1058.8434 1059.8335 1074.1367 1087.4951 1092.3756 1102.8286 1120.0326 1134.1653 1144.9859 1157.9950 1161.8180 1168.5412 1173.9733 1180.1682 1190.3669 1203.7991 1213.2560 1221.2366 1222.6908 1238.1095 1247.2508 1250.1155 1262.3741 1264.5094 1274.8211 1285.7920 1294.9542 1299.5089 1302.3355 1307.5184 1316.6331 1322.0333 1325.6912 1328.8148 1337.1379 1345.4686 1346.7778 1351.8437 1364.7402 1370.9584 1373.0370 1385.1145 1403.9805 1441.8283 1448.5359 1454.7822 1464.2785 1466.7909 1468.7894 1477.8784 1481.2975 1586.7178 1608.1061 1629.0186 1638.9187 2909.0347 2919.1751 2930.0936 2939.4748 2945.8550 2962.8140 2967.3965 2971.4676 2971.9001 2975.1319 2975.9883 2986.4486 2990.5765 2999.7627 3012.9138 3025.4939 3037.0510 3041.7517 3044.1626 3055.7515 3068.1359 3073.3639 3094.9294 3126.9936 3420.9375 3566.8285
redmass: 7.2555 7.6350 4.9834 6.0087 5.1944 5.0668 3.5962 4.4375 3.2252 3.0634 3.4346 4.0725 5.4707 3.9972 3.0214 3.3081 1.6812 4.9855 1.8837 3.5723 3.8995 3.2037 3.1332 3.2710 2.6147 2.4003 2.5783 1.8239 2.9214 2.2698 3.6616 3.3475 4.1876 3.0001 2.8749 3.7836 2.5055 3.1305 3.8108 3.9019 3.2909 4.3155 3.6509 2.2944 2.3191 2.3743 2.1181 2.4232 2.4452 2.5516 2.4829 1.6343 3.9075 2.2439 2.0310 2.6247 2.3610 2.5897 2.4517 2.2682 2.5909 2.3259 2.0736 2.6596 2.5194 2.5867 2.4748 3.0370 2.0468 1.9962 2.0960 2.3625 2.0781 1.4929 1.4940 1.9557 1.8083 1.2930 1.6680 1.1938 1.9987 1.5238 1.5045 1.2247 1.4272 1.2637 1.3786 1.3124 1.6978 1.3810 1.3924 1.4245 1.4076 1.3021 1.4181 1.3232 1.4972 1.4523 1.3766 1.3956 1.4473 1.4518 1.7094 1.6427 1.4068 1.5186 1.5761 1.4367 1.2021 1.0746 1.0820 1.0951 1.0891 1.1036 1.0792 1.0850 1.0955 9.7730 7.3762 8.0178 7.3852 1.0811 1.0800 1.0868 1.0591 1.0817 1.0803 1.0656 1.0831 1.0630 1.0986 1.0667 1.0647 1.0615 1.0826 1.0602 1.0624 1.1007 1.1017 1.0979 1.0995 1.0950 1.1032 1.1042 1.0917 1.0642 1.0660
irintensity: 0.1952 3.8637 4.3050 1.0530 1.9381 2.5521 1.6367 4.2987 13.4062 4.0881 1.2619 1.7088 5.8864 1.9519 2.8128 2.4981 41.6320 8.5239 55.7506 2.3585 25.1536 11.4952 2.8614 3.7976 19.2610 37.4725 1.3854 38.7524 8.0575 23.7595 2.6901 5.0396 4.5032 6.2618 7.0294 2.7563 0.3090 4.5397 1.4115 3.5036 15.2940 5.1920 2.4342 13.8291 6.9117 3.8772 15.1256 0.5446 1.0617 12.2512 0.2253 7.2472 41.1793 1.8859 16.3344 0.6151 10.3942 24.8189 11.5548 17.2867 13.6701 24.7262 21.4264 68.5577 17.1286 71.2027 2.9293 2.1406 5.0290 7.0896 9.6359 4.6064 17.3577 6.4775 10.0382 4.1558 5.0463 31.1798 9.9131 6.8970 7.7296 13.1541 11.0663 0.1226 3.7760 14.8600 105.8857 5.9546 51.9971 5.6664 11.3145 11.3077 28.8348 3.1330 4.3986 6.4729 15.0368 5.0646 22.0808 5.5445 21.4116 5.5000 23.3720 7.6390 30.5524 4.3090 13.1054 40.4969 2.8108 15.2499 12.7210 12.1197 11.3467 6.2094 6.1716 18.4143 16.3391 206.6290 50.3925 117.6637 165.4280 23.2413 14.5804 55.1641 52.3631 8.5562 50.1620 19.0682 23.3903 18.7787 22.2388 9.4778 49.7730 40.7415 19.4636 20.4498 42.6862 35.0377 21.6955 40.0469 31.4074 21.5111 0.6224 22.1121 7.7290 25.1685 3.7519
temp: 298.150 k
press: 1.00000 atm
elementType: 8 8 8 8 8 6 6 6 6 6 6 6 6 6 6 6 6 6 6 6 6 6 6 6 6 1 1 1 1 1 1 1 1 1 1 1 1 1 1 1 1 1 1 1 1 1 1 1 1 1 1
symmnumber: 1
zpe: 1113566.0 jmol-1
zpe.correction: 0.424135 hartree
zpe.thermalcorrener: 0.447389 hartree
zpe.thermalcorrenthalpy: 0.448333 hartree
zpe.thermalcorrgfe: 0.371974 hartree
zpe.sumelectzpe: -1151.913345 hartree
zpe.sumelectthermal: -1151.890091 hartree
zpe.sumelectthermalent: -1151.889147 hartree
zpe.sumelectthermalfe: -1151.965506 hartree
dipole: 0.5212 0.9711 -1.6829
dipole: 2.0116
quadrupole: -208.2799 -149.1669 -151.9592
quadrupole: 0.2551 24.2364 -8.6444
quadrupole: -38.4779 20.6351 17.8428 0.2551 24.2364 -8.6444
hfenergy: -1152.33748 hartree
pointgroup: C01 [X(C20H26O5)]
dipole: 0.2101169 0.4222424 -0.6355652 debye
polarizability: 286.4160314|-3.6692066|208.5772709|-13.7929031|8.6693334|176.5721536 unknown
InChI: InChI=1S/C20H26O5/c21-9-18(25)16-6-5-15-14-3-1-11-7-12(23)2-4-13(11)19(14)17(24)8-20(15,16)10-22/h7,10,13-17,19,21,24H,1-6,8-9H2
charge 0 multiplicity 1
51 atoms
O  -0.050065 -1.536729 1.808534
O  -1.974523 1.130923 2.152863
O  -4.992914 -0.127342 0.494293
O  -5.93828 -2.225883 -0.89561
O  6.132394 -0.975184 -1.415154
C  -0.813952 1.132964 -0.553477
C  -1.762417 0.003074 -0.057276
C  0.527491 1.122953 0.207318
C  1.204045 -0.275496 0.016567
C  -3.046087 0.334101 -0.926226
C  -1.119166 -1.374283 -0.320343
C  0.262059 -1.463831 0.365234
C  -1.694147 2.412033 -0.561321
C  2.55609 -0.307426 0.823063
C  -3.15402 1.891348 -0.805522
C  1.466466 2.260865 -0.258081
C  2.853519 2.200866 0.451384
C  3.431547 0.815653 0.275897
C  -2.143116 0.114615 1.440151
C  3.319964 -1.656258 0.862554
C  -4.306513 -0.412395 -0.529395
C  4.102971 -1.939357 -0.438082
C  4.584295 0.573456 -0.426546
C  5.044766 -0.783085 -0.790458
C  -4.765191 -1.568873 -1.418536
H  -0.582128 0.88562 -1.616034
H  0.317579 1.268648 1.285933
H  1.446733 -0.389587 -1.063547
H  -2.788477 0.049995 -1.968182
H  -0.993754 -1.524627 -1.410907
H  -1.740401 -2.20585 0.064603
H  0.751245 -2.410219 0.052048
H  -1.376015 3.118234 -1.348223
H  -1.633765 2.925849 0.411734
H  2.295866 -0.026104 1.869234
H  -3.806519 2.140172 0.048572
H  -3.610332 2.321449 -1.714359
H  0.994623 3.239896 -0.053382
H  1.620469 2.193342 -1.354976
H  2.705449 2.420567 1.528725
H  3.528903 2.971621 0.039426
H  -2.627885 -0.800574 1.853774
H  2.639342 -2.500038 1.082503
H  4.042612 -1.613435 1.701047
H  0.784388 -1.506272 2.340561
H  3.406691 -2.076804 -1.291422
H  4.699014 -2.865271 -0.361834
H  5.198463 1.403688 -0.798082
H  -3.932534 -2.298802 -1.516557
H  -4.967835 -1.165975 -2.435704
H  -6.209448 -1.722233 -0.075183
