program: Gaussian 09
title: 000127032
version: EM64L-G09RevD.01
frameworkgroup: C1[X(C7H15N3O)]
method: RPBEPBE
basis: SDD
operation: Freq
keyword: #p
keyword: freq=noraman
keyword: PBEPBE/SDD
title: #p freq=noraman PBEPBE/SDD
converged: YES YES NO NO
title: Mulliken charges:
elementType: O N N N C C C C C C C H H H H H H H H H H H H H H H
charge: -0.270450 -0.277777 -0.348999 -0.545352 -0.089525 -0.421187 -0.501264 -0.352431 -0.412752 0.151675 -0.414700 0.225406 0.207864 0.187688 0.245037 0.233853 0.259638 0.219604 0.182681 0.233380 0.236438 0.317444 0.205479 0.205198 0.261328 0.261725
chargesum: 0.00000
title: Mulliken charges with hydrogens summed into heavy atoms:
elementType: O N N N C C C C C C C
charge: -0.270450 -0.018139 -0.031555 -0.022299 0.135881 -0.025636 -0.022374 0.049854 0.057066 0.151675 -0.004024
polarizability: 1.20001819e+02 -3.33307580e+00 9.88136715e+01 -4.71479715e-01 1.88618018e-01 7.49514730e+01
1716.lowfreq: -8.9253 -0.0003 0.0003 0.0005 3.8920 4.7925 45.4005 61.1497 71.6085
frequency: 45.2608 61.0719 71.5814 113.6822 141.9190 151.6319 236.3483 254.2671 258.3555 271.4260 405.8509 414.9400 446.0916 487.6103 506.3237 556.0053 614.2285 656.3979 671.7686 730.4366 742.7687 798.3549 822.4486 849.5048 945.4322 965.0900 986.4390 1010.2067 1030.8192 1048.1346 1069.3213 1087.4356 1104.0815 1140.8932 1147.8028 1190.1354 1229.5938 1242.9539 1271.5895 1277.2499 1287.6683 1296.3547 1319.0904 1333.0075 1343.2636 1350.4331 1355.0173 1357.5753 1422.4497 1436.9279 1446.6081 1458.6346 1468.9499 1477.4910 1479.8081 1621.3423 1644.3959 2944.9881 2963.1935 2968.9560 2971.3510 2976.9882 2984.9651 3006.9845 3021.0126 3049.7515 3050.6736 3059.7518 3424.3197 3450.2239 3508.8650 3575.8717
redmass: 4.2765 2.5604 2.2370 3.4013 3.5792 2.2788 3.1951 3.7217 1.2512 1.7304 4.6811 2.5276 2.9894 2.2350 3.0858 2.4867 1.5741 1.5732 1.8798 1.6121 1.6377 1.5475 2.9160 1.8253 1.6205 3.3728 1.5786 2.7503 3.2969 1.2444 3.1805 2.6362 3.8080 4.7534 1.5069 1.2844 1.3309 1.3415 1.2864 1.3183 1.6537 1.2897 1.3304 1.1823 1.2654 1.4149 1.4750 1.5978 1.6788 1.1442 1.2170 1.0760 1.1419 1.0967 1.1010 6.1043 1.0884 1.0646 1.0626 1.0665 1.0764 1.0610 1.0683 1.0944 1.1014 1.1043 1.1000 1.0961 1.0742 1.0446 1.0763 1.0973
irintensity: 1.9491 2.4348 1.7252 1.4030 1.1571 0.4902 3.6341 1.4628 54.7720 15.8031 4.1493 18.1411 5.9629 7.7481 7.3046 50.9852 347.3367 66.5287 95.7819 24.9546 77.5591 1.8943 10.8286 2.6320 5.1361 38.3777 2.8567 8.0529 13.8957 0.2755 31.9365 2.1485 11.7317 35.6416 6.0696 2.0165 14.7134 10.5522 1.1926 2.1162 93.7276 14.9501 2.0789 2.2542 15.3367 8.2849 4.9376 17.0231 46.9224 9.1074 25.4254 1.0629 10.1077 9.7239 10.5127 336.9082 32.2640 11.8192 4.5908 56.0806 12.9964 76.8673 54.3387 16.3360 0.4447 70.4191 42.5643 29.5220 0.6923 1.3450 10.5540 0.1328
temp: 298.150 k
press: 1.00000 atm
elementType: 8 7 7 7 6 6 6 6 6 6 6 1 1 1 1 1 1 1 1 1 1 1 1 1 1 1
symmnumber: 1
zpe: 592823.6 jmol-1
zpe.correction: 0.225795 hartree
zpe.thermalcorrener: 0.237870 hartree
zpe.thermalcorrenthalpy: 0.238814 hartree
zpe.thermalcorrgfe: 0.186984 hartree
zpe.sumelectzpe: -514.325783 hartree
zpe.sumelectthermal: -514.313708 hartree
zpe.sumelectthermalent: -514.312764 hartree
zpe.sumelectthermalfe: -514.364594 hartree
dipole: -1.6392 3.2185 -0.2013
dipole: 3.6174
quadrupole: -95.1071 -65.7638 -63.4747
quadrupole: 11.0177 5.2339 0.5803
quadrupole: -20.3252 9.0181 11.3072 11.0177 5.2339 0.5803
hfenergy: -514.551578 hartree
pointgroup: C01 [X(C7H15N3O1)]
dipole: -0.6485675 1.2667766 -0.0130328 debye
dipolederiv: -1.0672672 0.4301465 0.0744764 0.253154 -0.819191 -0.0420525 0.0768605 -0.0529997 -0.3872352 -0.8396823 0.0884125 0.098854 -0.0037807 -0.6275477 -0.086598 0.0615407 -0.0586417 -0.1380517 -0.5590134 -0.0114939 -0.0034794 0.385819 -1.1118082 -0.0513673 0.0527675 -0.1084844 -0.5035309 -1.1305856 -0.0102464 0.0907179 -0.0502832 -0.3281092 0.1194067 0.1517575 0.1130409 -0.273693 0.3536004 0.0223335 0.0502591 0.0026274 0.3736942 0.0857891 0.1124238 0.144637 0.2570735 -0.1176929 -0.0100527 0.0058172 -0.0160613 0.0785485 0.0195755 0.0508307 0.0330444 0.1609718 -0.3790615 -0.044406 0.0262619 -0.1865334 -0.1004006 -0.0115206 0.030333 -0.0010314 0.1376748 -0.247722 0.0277648 0.0138287 -0.0867384 0.0343494 0.0482951 0.0880408 0.0624956 0.1323913 0.9385542 -0.2462742 -0.0403483 -0.0964973 0.5630731 -0.0681699 -0.1499682 -0.0789697 0.4326291 1.0949023 -0.2019031 -0.1132564 -0.3132414 1.5089765 0.113813 -0.1783556 0.1156781 0.1674538 0.6622957 -0.0490818 0.0018292 -0.0658596 0.3233897 -0.0584168 0.0005641 -0.0679614 0.2620784 0.0529053 0.0104855 0.0008224 0.0088356 -0.0078779 0.0616965 -0.0164674 0.0255822 -0.1537809 0.0435455 -0.0063507 -0.004238 0.0033878 -0.1425084 -0.0619984 -0.0103004 -0.0902576 0.0427779 0.0334434 -0.0025621 -0.0240791 0.0192618 0.0657299 0.0083283 -0.0228906 0.0523169 -0.1851921 0.0683186 0.0200473 -0.0049016 0.0038173 -0.0372498 -0.0861905 -0.0174435 -0.1144849 0.0224124 0.049538 -0.0258773 0.0340508 0.0094238 0.0596022 0.0363259 0.0098426 0.0847102 -0.0794923 0.2597065 -0.0916871 -0.0801298 -0.1222213 0.1526306 0.133556 -0.0075177 0.0218817 -0.0017922 0.1049117 -0.004344 0.0030846 0.0024859 -0.1269885 -0.0378692 0.0124233 -0.0658299 0.044354 0.0308406 0.007154 -0.0013039 0.002178 0.0606929 0.0041676 -0.0176327 0.0263619 -0.1985581 -0.0076358 -0.0322244 -0.0293459 -0.0149388 -0.110676 -0.0792893 -0.0499563 -0.1384454 0.0152897 -0.0367323 0.0939679 -0.0236202 0.0585976 -0.0004891 0.0377254 -0.0067367 0.150529 -0.1332035 0.038736 -0.002452 0.0266221 0.0217223 0.1331398 -0.0068139 0.058455 0.0092536 0.3323565 0.0032473 0.0072602 -0.0037782 -0.0244075 -0.1794249 -0.0451379 0.0078475 -0.0867009 0.0574624 0.0057172 0.0198263 -0.038319 -0.005266 0.0710662 0.0016923 -0.0167467 0.0390832 -0.1935286 0.3352322 0.0703997 0.0428937 0.1424287 0.1841724 0.0269699 -0.0851824 0.0016925 -0.0222274 0.3098982 -0.0588425 -0.102718 0.0720898 -0.0167944 -0.0619169 -0.1344889 -0.0164999 0.2053606 unknown
polarizability: 120.0220934|-3.2431001|98.7086222|-0.6063114|1.4373467|75.0362477 unknown
InChI: InChI=1S/C7H15N3O/c8-3-1-2-6-4-7(11)10-5-9-6/h6,9-10H,1-5,8H2
charge 0 multiplicity 1
26 atoms
O  3.778988 -1.180359 -0.199584
N  0.367313 1.138955 0.464283
N  2.77662 0.901915 0.020931
N  -4.980238 0.257143 -0.163626
C  0.149273 -0.151392 -0.247521
C  -1.20624 -0.768917 0.154154
C  1.334155 -1.124629 0.008343
C  -2.425206 0.063245 -0.301274
C  1.580212 1.808578 0.018534
C  2.725936 -0.481347 -0.083366
C  -3.771718 -0.489837 0.239694
H  0.121059 0.094282 -1.32986
H  -1.2687 -1.792401 -0.26793
H  -1.228193 -0.890461 1.259817
H  1.322871 -1.974382 -0.697861
H  1.246527 -1.563089 1.023778
H  0.343889 1.007835 1.486477
H  -2.292021 1.110791 0.032732
H  -2.463961 0.085536 -1.410749
H  1.794793 2.672306 0.672532
H  1.416589 2.18624 -1.011185
H  3.712597 1.313729 -0.050115
H  -3.897608 -1.541844 -0.084597
H  -3.737134 -0.510653 1.347181
H  -5.17725 0.21838 -1.168969
H  -5.007453 1.220677 0.185779
