program: Gaussian 09
title: 000127073
version: EM64L-G09RevD.01
frameworkgroup: C1[X(C13H11NO4S)]
method: RPBEPBE
basis: SDD
operation: Freq
keyword: #p
keyword: freq=noraman
keyword: PBEPBE/SDD
title: #p freq=noraman PBEPBE/SDD
converged: YES YES NO NO
title: Mulliken charges:
elementType: S O O O O N C C C C C C C C C C C C C H H H H H H H H H H H
charge: 0.978882 -0.202685 -0.612793 -0.569508 -0.688121 -0.150781 -0.686522 0.335833 0.196426 0.287286 0.177401 -0.551470 -0.383446 -0.409467 -0.369206 0.305601 -0.347819 -0.220146 -0.228356 0.258554 0.258598 0.291489 0.255115 0.250795 0.248169 0.326991 0.235959 0.237367 0.411229 0.364626
chargesum: 0.00000
title: Mulliken charges with hydrogens summed into heavy atoms:
elementType: S O O O O N C C C C C C C C C C C C C
charge: 0.978882 -0.202685 -0.248167 -0.569508 -0.276892 -0.150781 -0.169370 0.335833 0.196426 0.287286 0.177401 -0.259980 -0.128331 -0.158672 -0.121036 0.305601 -0.020829 0.015813 0.009011
polarizability: 3.93900095e+02 3.65926756e+01 2.04697804e+02 -6.04940228e+00 4.97334839e+00 9.14796105e+01
1716.lowfreq: -10.7353 -0.0017 -0.0011 0.0017 2.1914 4.1002 14.5105 18.9682 28.0461
frequency: 12.9839 18.9167 27.9644 48.8331 61.5799 101.0764 128.2540 131.9165 167.5309 176.3847 190.0648 234.8179 235.6267 248.2985 280.9005 319.8629 358.3024 371.9668 385.7115 422.7775 440.0893 483.9933 491.7573 522.1082 524.1038 543.8491 581.6822 614.9573 632.9256 651.6089 705.8031 734.0057 745.0968 767.6598 786.3068 824.0152 860.2616 874.0815 907.9262 911.7242 936.6971 950.5619 956.7022 980.0855 992.5445 996.9901 1015.1116 1024.5184 1036.7542 1097.6852 1110.3497 1138.6033 1150.8114 1172.4696 1190.5040 1196.7252 1206.4000 1252.2151 1297.7573 1312.6035 1340.7549 1347.2575 1390.5141 1393.7166 1426.4607 1442.3648 1460.9937 1469.0255 1484.6816 1566.5262 1586.0087 1618.6631 1622.5666 2419.1172 2989.6066 3034.9633 3116.7439 3131.4570 3138.8978 3151.1642 3153.6568 3157.0581 3168.5322 3470.1572
redmass: 9.0392 6.0627 9.4963 7.2724 6.9452 13.0534 4.5819 7.1989 4.9632 2.3133 5.2251 4.2304 4.2149 3.2445 7.0751 2.1542 4.7087 8.5545 6.9446 2.8000 2.8667 5.4166 3.2187 15.5945 5.4052 5.8692 3.3724 12.1285 6.6549 7.9157 3.0873 5.7466 1.6945 5.4373 2.0146 4.9092 1.3889 1.4176 1.5513 6.6532 3.0905 1.2290 1.3925 1.8125 7.0878 1.3580 1.3025 2.1280 1.2631 2.2282 1.9376 1.1513 1.5858 1.1660 1.8689 2.6482 1.6108 1.9977 1.5260 2.0048 7.6951 1.1571 3.5137 5.8206 1.1804 2.3093 2.9366 3.5640 4.5654 6.5170 6.4385 7.1137 7.4819 1.0839 1.0613 1.0993 1.0935 1.0861 1.0897 1.0952 1.0925 1.0949 1.1004 1.0660
irintensity: 0.5797 0.1086 3.0134 0.3293 0.3387 8.4878 1.9279 4.0703 2.2526 1.4022 77.6363 2.8852 7.2197 4.4644 24.9860 131.8262 5.6191 86.7887 12.4507 12.2512 0.4770 1.3493 0.1028 173.3225 3.6951 0.2159 4.7059 158.1438 19.2475 25.8676 0.0538 23.3027 56.7745 15.4729 43.9134 0.5043 12.3755 0.0210 4.3331 167.7074 31.1800 55.1038 24.8956 27.6612 5.9008 0.3996 21.4543 0.4081 36.0109 173.6717 106.4038 0.0778 15.8319 3.2997 100.9706 185.7726 25.5672 147.0602 19.0950 50.7065 411.8186 511.2942 9.6512 16.0124 13.0048 4.0631 27.9174 20.6861 47.3288 14.0039 2.3045 43.6036 189.3775 4187.2971 5.3495 3.7548 32.6433 1.9937 1.2900 19.5840 1.0132 6.8670 37.4124 24.8327
temp: 298.150 k
press: 1.00000 atm
elementType: 16 8 8 8 8 7 6 6 6 6 6 6 6 6 6 6 6 6 6 1 1 1 1 1 1 1 1 1 1 1
symmnumber: 1
zpe: 554018.8 jmol-1
zpe.correction: 0.211015 hartree
zpe.thermalcorrener: 0.229062 hartree
zpe.thermalcorrenthalpy: 0.230006 hartree
zpe.thermalcorrgfe: 0.161162 hartree
zpe.sumelectzpe: -1254.195276 hartree
zpe.sumelectthermal: -1254.177229 hartree
zpe.sumelectthermalent: -1254.176285 hartree
zpe.sumelectthermalfe: -1254.245128 hartree
dipole: -11.0982 0.7014 0.4992
dipole: 11.1316
quadrupole: -125.9903 -115.4475 -118.7173
quadrupole: 5.4441 -0.2071 -4.6275
quadrupole: -5.9386 4.6042 1.3344 5.4441 -0.2071 -4.6275
hfenergy: -1254.4062905 hartree
pointgroup: C01 [X(C13H11N1O4S1)]
dipole: -4.3050751 -0.4708081 -0.6516641 debye
polarizability: 398.9535753|-20.8769724|166.2430425|3.8971034|49.6472028|124.8808923 unknown
InChI: InChI=1S/C13H9NO.H2O3S/c15-14-11-5-6-13-10(8-11)7-9-3-1-2-4-12(9)13;1-4(2)3/h1-6,8H,7H2;1-2H
charge 0 multiplicity 1
30 atoms
S  5.843249 0.650472 1.007037
O  2.900288 -2.330824 -0.889701
O  6.122615 1.249021 -0.735757
O  6.098452 1.904494 1.983366
O  4.051226 0.534748 0.997841
N  2.6193 -1.25376 -0.242337
C  -2.425822 -1.746758 -1.061831
C  -1.11394 -1.164305 -0.551611
C  -1.374055 0.037719 0.201355
C  -3.462021 -0.764923 -0.530986
C  -2.819688 0.27763 0.210778
C  0.187829 -1.627284 -0.721245
C  -0.314333 0.776828 0.784849
C  -4.85945 -0.772414 -0.67883
C  -3.575903 1.315521 0.806885
C  1.248919 -0.87243 -0.129639
C  1.003615 0.322015 0.617607
C  -5.614891 0.26749 -0.081628
C  -4.978459 1.301728 0.654539
H  -2.594526 -2.773465 -0.682839
H  -2.443773 -1.812834 -2.167002
H  0.432604 -2.534079 -1.284106
H  -0.512422 1.688689 1.356742
H  -5.36279 -1.564363 -1.244192
H  -3.088018 2.114831 1.375208
H  1.860964 0.857745 1.045807
H  -6.705228 0.27558 -0.188094
H  -5.584562 2.093918 1.106591
H  3.661842 -0.280096 0.437532
H  5.813678 2.201105 -0.781941
