program: Gaussian 09
title: 000127043
version: EM64L-G09RevD.01
frameworkgroup: C1[X(C9H8N4O3S2)]
method: RPBEPBE
basis: SDD
operation: Freq
keyword: #p
keyword: freq=noraman
keyword: PBEPBE/SDD
title: #p freq=noraman PBEPBE/SDD
converged: NO YES NO NO
title: Mulliken charges:
elementType: S S O O O N N N N C C C C C C C C C H H H H H H H H
charge: 0.992336 0.212149 -0.505421 -0.534530 -0.116225 -0.246597 -0.033421 -0.004773 0.336519 -0.244716 0.194806 -0.188814 -0.083053 0.462261 -0.385892 -0.604227 -0.598941 -0.740221 0.309386 0.275803 0.255257 0.212634 0.275352 0.285899 0.226140 0.248290
chargesum: 0.00000
title: Mulliken charges with hydrogens summed into heavy atoms:
elementType: S S O O O N N N N C C C C C C C C C
charge: 0.992336 0.212149 -0.505421 -0.534530 -0.116225 -0.246597 -0.033421 -0.004773 0.336519 -0.244716 0.194806 0.120572 -0.083053 0.462261 -0.110090 0.139017 0.161388 -0.740221
polarizability: 3.85992237e+02 -7.80343960e+00 1.65514294e+02 2.58375260e+00 -1.85533850e-01 1.07998133e+02
1716.lowfreq: -4.0547 -2.6866 -0.0016 -0.0011 0.0014 7.4040 19.6064 22.1224 35.8057
frequency: 19.5948 22.0445 35.7958 60.1147 82.5706 108.5511 129.1690 182.9195 186.9304 203.2422 207.9388 212.6579 227.5510 236.1177 244.5718 276.9510 291.0723 344.6546 367.6864 384.5195 394.0870 406.9566 438.2699 444.4859 477.3336 521.2565 554.9832 568.3509 577.4017 624.9705 630.6111 711.5383 779.1157 803.9649 814.6315 838.2352 858.4508 866.3642 882.9843 947.6779 959.6722 975.7462 1020.3274 1075.9233 1080.4752 1104.5630 1133.2463 1179.5118 1212.3189 1254.9234 1293.8449 1297.5801 1345.2365 1410.4577 1422.6123 1443.9837 1454.4363 1459.0674 1469.6350 1473.7555 1474.3580 1533.1306 1585.4621 2182.9290 2928.2671 2951.4227 3046.0735 3051.0722 3099.7844 3103.4930 3144.4519 3177.3188
redmass: 13.5693 5.9742 5.0294 4.4311 4.4798 9.7638 4.9833 3.9544 5.6114 3.4013 3.5035 1.4527 1.5554 5.2113 9.7537 10.7366 4.5596 5.9273 11.1566 4.2629 4.3594 11.5585 9.8038 13.0242 6.0016 8.1513 8.6715 6.1421 8.8459 7.7342 6.0912 11.2295 7.4704 12.6005 14.2094 13.7701 4.2103 1.4018 9.4231 13.9161 15.6362 1.3838 1.4168 2.0747 1.2748 1.3528 3.0775 5.2931 1.7003 2.0351 2.0887 8.6170 9.4071 1.1261 1.1315 10.4256 1.0479 1.0518 1.0589 1.2917 2.5849 7.2585 8.4449 12.9122 1.0452 1.0389 1.0880 1.0959 1.0991 1.0987 1.0904 1.0941
irintensity: 0.1101 1.9374 3.8299 1.3044 1.8037 1.4350 1.4167 2.1621 0.2647 0.6792 1.0165 0.5523 5.1994 1.1443 1.0003 1.7740 8.2990 4.6707 37.8046 3.0172 5.3050 2.7758 23.8688 91.9781 53.7997 3.7834 14.0378 10.0847 23.8870 2.7461 14.8837 16.3612 4.2194 63.2145 155.7465 10.7142 47.4611 28.5563 3.1529 5.7822 65.2075 0.8052 0.8316 3.7723 0.2320 19.5686 1.2922 12.7285 27.3319 8.6563 0.7375 28.5238 13.7417 26.2910 4.2210 23.5656 16.0209 12.7053 7.9019 55.6664 15.1570 151.1071 18.7101 1916.5292 48.8891 41.9780 14.7508 31.2765 2.0193 0.9508 6.2821 8.9339
temp: 298.150 k
press: 1.00000 atm
elementType: 16 16 8 8 8 7 7 7 7 6 6 6 6 6 6 6 6 6 1 1 1 1 1 1 1 1
symmnumber: 1
zpe: 438499.6 jmol-1
zpe.correction: 0.167016 hartree
zpe.thermalcorrener: 0.185171 hartree
zpe.thermalcorrenthalpy: 0.186115 hartree
zpe.thermalcorrgfe: 0.118429 hartree
zpe.sumelectzpe: -1586.973209 hartree
zpe.sumelectthermal: -1586.955054 hartree
zpe.sumelectthermalent: -1586.954109 hartree
zpe.sumelectthermalfe: -1587.021796 hartree
dipole: 1.7720 -1.4948 4.5143
dipole: 5.0748
quadrupole: -135.2401 -125.2406 -119.2392
quadrupole: -14.4399 -16.8873 0.3257
quadrupole: -8.6668 1.3327 7.3342 -14.4399 -16.8873 0.3257
hfenergy: -1587.1402247 hartree
pointgroup: C01 [X(C9H8N4O3S2)]
dipole: -0.7716892 -1.4753998 -1.101795 debye
dipolederiv: 2.2944362 -0.0780444 0.04108 -0.137529 1.01154 0.0577592 0.0772149 0.1030942 1.4693012 -1.5079643 -0.0812313 0.0507117 -0.071358 -0.0038489 0.0020005 -0.0163814 -0.0013162 0.0003885 -0.7471113 -0.0155105 -0.0244295 -0.1036076 -0.5394793 -0.1222312 -0.0313146 -0.0650411 -0.5330407 -0.7206905 0.0541313 -0.0313992 0.1460963 -0.5738666 0.1256725 -0.0587029 0.0405197 -0.5690872 0.3276316 0.018127 -0.002977 -0.0612646 -0.3343025 0.1376429 0.0593871 0.1588525 -0.1719708 -0.5644038 -0.0135777 -0.2704992 0.0745863 -0.4331361 0.0063203 -0.2457978 0.0063211 -0.3783727 -0.1322016 -0.1404955 0.0672893 0.2106684 0.0377907 -0.0865368 -0.0977861 -0.0748638 -0.0256416 -0.3545184 0.1295862 -0.0453717 -0.0734798 0.1207308 -0.1274237 0.0118533 -0.1190964 -0.0087118 -3.3295914 -0.167861 0.0939916 -0.1587156 -0.1268863 0.0682669 -0.01428 0.0646892 -0.0523351 -0.4296951 -0.0296204 0.0450878 -0.089524 -0.1831719 -0.0636529 0.2752981 -0.0279757 -0.354008 -0.403495 -0.1855412 0.1134367 -0.2567779 0.1082798 0.0458934 0.0864905 -0.0060048 0.1216749 0.26884 -0.0594847 0.0938006 0.184309 -0.0281078 0.0011591 -0.175109 -0.0173154 -0.0050179 -0.2797196 0.1877148 -0.1105276 -0.1196331 -0.0313332 0.0751287 0.075754 0.0828522 0.038855 2.1160041 0.1048161 -0.0669028 0.0981319 0.2734585 -0.1031373 0.0002534 -0.0972401 0.1728348 -0.5717544 0.092571 -0.0679157 0.3535085 -0.0113903 -0.0543808 -0.264836 -0.0729749 -0.0847099 0.1455836 0.0734755 0.2879539 -0.191808 0.1638524 0.262651 0.0984939 0.0410177 0.0382405 0.157962 -0.0453979 0.1868677 0.101954 0.0968949 -0.3181831 0.1743718 -0.0967763 0.0397136 3.4084664 0.17008 -0.0730019 0.1333384 -0.0209136 -0.0147692 0.0530182 -0.0093731 -0.0404578 0.1527857 0.0380474 -0.0325489 0.0251183 0.1115969 0.0046529 0.0116784 0.0114293 0.1231391 0.0060631 -0.0446107 0.032625 -0.0638411 0.0618812 0.0659021 0.0440611 0.0654296 0.1296153 0.0080977 0.006332 0.0623371 0.0301792 0.0895716 -0.0852947 0.1265173 -0.0890189 -0.0353981 -0.0452581 -0.0571258 -0.1898654 0.0728546 0.0081387 -0.0159566 -0.1030607 -0.0496113 -0.001715 0.1344085 -0.0556883 -0.0358976 -0.031109 0.0324174 0.0468609 -0.0468251 0.1371542 0.0760014 0.1811406 0.0310759 -0.0601727 -0.0013928 0.0393168 -0.0284701 -0.0705687 -0.102206 0.0891184 -0.079163 0.0496811 -0.1548134 -0.079465 0.0322333 0.0662416 -0.1123393 0.0649926 -0.0029995 -0.0358529 0.0185512 0.0911411 0.0087605 0.0987333 0.0538844 0.1426096 0.0524616 -0.0354168 unknown
polarizability: 384.0395768|7.7892207|148.3416627|-21.7315544|-27.0732148|127.1234252 unknown
InChI: InChI=1S/C9H8N4O3S2/c1-13(2)18(14,15)7-4-3-6(10-5-17)8-9(7)12-16-11-8/h3-4H,1-2H3
charge 0 multiplicity 1
26 atoms
S  2.646746 -0.39745 0.61228
S  -6.355752 -0.68165 0.384673
O  3.093902 1.052542 1.178895
O  2.957845 -1.784674 1.39946
O  -0.825236 2.332056 -1.324112
N  3.452251 -0.584794 -1.06594
N  0.408549 1.711178 -0.895566
N  -1.987772 1.599217 -0.891322
N  -3.527875 -0.581159 0.435033
C  0.73339 -0.412571 0.455551
C  -0.008336 0.614309 -0.201126
C  0.051254 -1.456265 1.068052
C  -1.4669 0.549705 -0.206316
C  -2.166909 -0.538778 0.44304
C  -1.381786 -1.525256 1.062266
C  3.0128 -1.818889 -1.749642
C  3.452753 0.665736 -1.856201
C  -4.737693 -0.623877 0.411386
H  0.637258 -2.230333 1.577024
H  -1.881657 -2.360275 1.560913
H  3.769569 -2.049296 -2.520866
H  2.020457 -1.731149 -2.245053
H  3.004062 -2.65107 -1.02631
H  3.608714 1.520892 -1.178411
H  2.523768 0.829138 -2.440742
H  4.315098 0.610013 -2.545466
