program: Gaussian 09
title: 000011961
version: EM64L-G09RevD.01
frameworkgroup: C1[X(C10H10O3)]
method: RPBEPBE
basis: SDD
operation: Freq
keyword: #pfreq=noraman
keyword: PBEPBE/SDD
title: #p freq=noraman PBEPBE/SDD
converged: YES YES NO NO
title: Mulliken charges:
elementType: O O O C C C C C C C C C C H H H H H H H H H H
charge: -0.331537 -0.165796 -0.188801 0.234030 -0.474537 -0.331371 -0.325556 -0.657825 0.192197 0.277611 -0.217718 -0.216127 -0.218481 0.245460 0.251531 0.271225 0.266064 0.236885 0.217715 0.228396 0.237024 0.234060 0.235551
chargesum: 0.00000
title: Mulliken charges with hydrogens summed into heavy atoms:
elementType: O O O C C C C C C C C C C
charge: -0.331537 -0.165796 -0.188801 0.234030 0.022455 -0.060147 -0.059492 0.025171 0.192197 0.277611 0.019306 0.017934 0.017070
polarizability: 1.72290344e+02 -4.91562865e+00 1.17558502e+02 6.72129243e-01 -1.36627522e+00 6.28305793e+01
1716.lowfreq: -9.5272 -3.9420 0.0005 0.0006 0.0006 2.8941 23.1015 37.5810 43.7412
frequency: 21.6719 37.5372 43.7111 74.2970 111.7931 160.5841 184.3370 211.9929 240.1682 288.6295 375.8886 403.1225 430.5384 475.5617 514.7550 586.6748 613.2390 656.5787 684.7559 699.7111 749.8837 785.6238 794.4429 808.5261 863.4149 951.6347 956.7988 986.8376 991.8764 995.8466 1010.1144 1025.6821 1041.6138 1083.8142 1085.3073 1097.5359 1175.2399 1183.0727 1232.8006 1240.8606 1315.0704 1334.0132 1391.3366 1399.6416 1437.0054 1438.5459 1472.4165 1476.3433 1480.5439 1586.9115 1610.1081 1640.0612 1713.1691 2994.6383 3001.4507 3043.0195 3099.4124 3105.1041 3133.1481 3145.5359 3157.0632 3169.0906 3181.1219
redmass: 2.4174 3.5192 4.8101 4.2434 6.3224 4.9967 1.2447 4.4309 5.4213 4.5248 6.8934 2.8201 3.8508 7.3056 2.6720 6.2590 6.4377 5.8906 4.7004 1.6571 4.4328 2.5345 1.7337 2.9008 1.2451 3.9837 1.7729 3.4992 4.8864 1.3949 1.3359 2.1563 2.0354 1.6483 1.5697 2.4049 1.0561 1.1343 3.7765 1.1822 1.3173 1.7501 10.0509 1.2088 1.0817 2.2448 1.0389 2.2440 1.0541 6.3865 6.0573 11.7998 11.0846 1.0610 1.0371 1.0974 1.1005 1.1004 1.0857 1.0891 1.0940 1.0982 1.0976
irintensity: 0.0881 2.7953 0.9547 0.5932 0.1203 0.6508 1.1371 2.8885 3.0407 0.6707 8.3090 0.0177 1.9404 2.4480 8.6307 2.6439 2.3820 27.5466 1.1622 81.6556 29.3662 81.5333 15.1155 10.1958 0.0599 803.8839 217.6117 138.0275 87.6319 0.7733 0.2658 20.2290 78.2083 2.5477 8.9106 41.9785 0.1090 21.4369 186.4562 0.4781 1.0502 29.5651 3.6637 17.5930 31.0126 17.4763 13.1664 4.0633 14.2246 11.4472 23.6667 114.9190 269.7537 22.7495 20.4938 3.4386 27.3457 25.8500 0.3073 8.9529 13.2000 21.4242 7.7979
temp: 298.150 k
press: 1.00000 atm
elementType: 8 8 8 6 6 6 6 6 6 6 6 6 6 1 1 1 1 1 1 1 1 1 1
symmnumber: 1
zpe: 461765.9 jmol-1
zpe.correction: 0.175877 hartree
zpe.thermalcorrener: 0.188477 hartree
zpe.thermalcorrenthalpy: 0.189421 hartree
zpe.thermalcorrgfe: 0.134415 hartree
zpe.sumelectzpe: -611.801542 hartree
zpe.sumelectthermal: -611.788943 hartree
zpe.sumelectthermalent: -611.787998 hartree
zpe.sumelectthermalfe: -611.843004 hartree
dipole: 1.7360 -3.9442 -1.2253
dipole: 4.4801
quadrupole: -57.9421 -75.9442 -79.3292
quadrupole: 6.3660 5.4692 -2.2022
quadrupole: 13.1297 -4.8724 -8.2573 6.3660 5.4692 -2.2022
hfenergy: -611.9774193 hartree
pointgroup: C01 [X(C10H10O3)]
dipole: 0.7434959 -1.5880327 -0.1793759 debye
dipolederiv: -2.7881762 -0.3730857 0.3142787 -0.6650895 -0.6345882 0.0339939 0.2251495 0.0024033 -0.3236184 -0.8402856 -0.0479281 0.0587038 0.3896725 -0.5468965 -0.3123678 0.336959 -0.232767 -0.4672042 -0.7405692 0.1802558 -0.0913249 -0.0606943 -0.8563385 0.2234787 -0.0656109 0.206311 -0.3489026 -0.7567113 0.1612457 -0.0721827 0.1324267 -0.112064 0.0478567 -0.071914 0.0412437 -0.0346681 -0.1283999 -0.0876528 -0.0103351 -0.1883888 -0.129446 -0.1455411 -0.1153708 -0.1806029 0.0050937 0.1033639 -0.1578081 0.0582904 0.1387501 0.0241475 -0.0372309 -0.0345586 -0.041887 -0.0891592 0.1180717 0.0775412 -0.0119136 -0.1656746 -0.0070274 -0.0413478 0.0644352 -0.0261712 -0.0922178 -0.0291038 0.009599 0.0318941 -0.0338235 0.0531175 -0.0044059 0.0016947 -0.0054938 0.0623211 2.4683845 -0.0555625 0.0668271 0.711775 1.2424233 -0.4067494 0.0992725 -0.2927327 0.3558912 2.5258952 0.2578872 -0.2589745 -0.3339781 0.7306779 0.5174185 -0.4675068 0.3810778 0.5722418 -0.0144082 0.1974323 -0.049616 0.2094781 -0.0901457 -0.0108841 -0.0558971 -0.0089917 -0.1528445 -0.2660391 -0.0734102 0.0201948 -0.1006517 0.1201663 -0.0877904 0.027693 -0.0901412 -0.1266771 0.1347442 -0.0312354 0.0258305 -0.0310574 0.0424205 -0.0529882 0.0254887 -0.055358 -0.1101019 -0.0070677 0.0712751 -0.0318205 0.0904033 -0.0231817 0.0229339 -0.006484 0.0651426 0.1120422 0.0325376 -0.0455111 0.0311912 -0.0154972 0.1051161 0.0310276 0.0639632 0.0122181 -0.0788986 0.1276973 0.0418399 -0.0156943 0.0034769 0.0042546 0.0479106 -0.002587 0.0482379 0.1406145 0.0542229 -0.0795224 0.017328 -0.0960997 0.0558537 0.031198 0.0246753 0.0249089 0.1427837 0.0575321 0.049042 -0.0059735 0.118774 -0.0675162 0.059821 -0.0001851 0.058696 0.0803752 -0.0470743 -0.1000893 -0.0382784 -0.1400991 -0.0333704 -0.0759226 -0.0635327 -0.0829329 0.05961 0.0727894 0.0056556 -0.0117193 0.022501 0.1028128 0.0175367 0.0486 0.0356054 -0.137077 -0.0489877 -0.0878001 0.0177092 -0.0997991 0.0206031 0.0381798 0.0200395 0.0383732 0.1492471 0.0686841 0.0276796 -0.0130368 0.0520861 -0.0819237 0.0768225 -0.020334 0.0758276 0.1344178 -0.0970998 0.0601522 -0.0313783 0.0615092 0.0809048 0.0270503 -0.0339895 0.027033 0.1467313 unknown
polarizability: 172.5676057|-2.5307448|114.8026573|1.9258696|-11.3988334|65.309162 unknown
InChI: InChI=1S/C10H10O3/c1-2-9(11)13-10(12)8-6-4-3-5-7-8/h3-7H,2H2,1H3
charge 0 multiplicity 1
23 atoms
O  -1.111493 -0.325077 -0.269974
O  -2.788613 0.955404 0.784805
O  -0.425631 1.868088 -0.780334
C  1.250976 0.193931 -0.199336
C  -3.385841 -1.111253 -0.444726
C  2.338502 1.082329 -0.417586
C  1.497181 -1.137333 0.22758
C  -4.835926 -0.984316 0.053889
C  -0.122871 0.714018 -0.429853
C  -2.478703 -0.02332 0.095859
C  3.660035 0.641607 -0.208754
C  2.822643 -1.572826 0.43544
C  3.904314 -0.68657 0.217673
H  -2.944049 -2.08992 -0.177136
H  -3.334864 -1.057648 -1.550437
H  2.124678 2.105211 -0.744895
H  0.652578 -1.812249 0.389708
H  -5.262403 -0.004363 -0.219068
H  -5.463263 -1.776185 -0.390895
H  -4.888586 -1.073721 1.152554
H  4.497634 1.326945 -0.375854
H  3.014278 -2.599277 0.765785
H  4.932624 -1.028476 0.379954
