program: Gaussian 09
title: 000127027
version: EM64L-G09RevD.01
frameworkgroup: C1[X(C10H20O7)]
method: RPBEPBE
basis: SDD
operation: Freq
keyword: #pfreq=noraman
keyword: PBEPBE/SDD
title: #p freq=noraman PBEPBE/SDD
converged: YES YES NO NO
title: Mulliken charges:
elementType: O O O O O O O C C C C C C C C C C H H H H H H H H H H H H H H H H H H H H
charge: -0.284287 -0.241815 -0.455973 -0.432592 -0.450952 -0.437478 -0.434773 -0.146173 -0.201718 -0.092396 -0.072310 0.003777 -0.348085 0.007569 -0.040235 -0.702624 -0.693022 0.199579 0.272633 0.248526 0.208504 0.190663 0.203900 0.227184 0.187137 0.174698 0.363733 0.334243 0.366504 0.211365 0.222269 0.243513 0.263457 0.180548 0.234240 0.356168 0.334223
chargesum: 0.00000
title: Mulliken charges with hydrogens summed into heavy atoms:
elementType: O O O O O O O C C C C C C C C C C
charge: -0.284287 -0.241815 -0.092240 -0.098349 -0.084448 -0.081310 -0.100550 0.053405 0.070915 0.156129 0.136194 0.194441 0.083000 0.194706 0.134462 -0.025477 -0.014777
polarizability: 1.57980171e+02 3.97241604e+00 1.37347747e+02 -2.32813835e+00 -8.01876454e-01 1.07219704e+02
1716.lowfreq: -22.3535 -9.6007 0.0006 0.0007 0.0009 0.5953 5.1382 22.3098 29.4484
frequency: -20.3258 22.2574 29.3090 44.8723 82.9211 90.3041 98.0637 138.8952 166.8234 168.7450 178.7639 204.4017 211.3882 220.1457 239.0661 257.3658 268.7769 291.3201 316.3578 324.7142 336.9233 368.4125 384.5035 397.8514 412.4846 431.1033 451.0604 452.9869 486.8387 493.9935 542.9118 556.0659 585.0534 604.9889 668.7079 762.6273 831.1893 855.5431 902.9002 909.8580 928.9829 961.1961 979.2182 982.2018 1002.9461 1011.8848 1020.0284 1021.8312 1042.6579 1056.1008 1079.9075 1080.4469 1092.1079 1112.3300 1118.3143 1128.4516 1165.2723 1178.8348 1182.4617 1199.4070 1219.0386 1229.1460 1246.8020 1258.2300 1287.2366 1288.6985 1299.2382 1303.1532 1326.4082 1330.7355 1339.3289 1343.2017 1359.2877 1362.9341 1372.4112 1376.6209 1382.6753 1389.6186 1391.2034 1413.4575 1455.3406 1459.9132 1461.3644 1474.1949 1486.1353 2902.4022 2905.0172 2908.5608 2915.6182 2972.8776 2973.7210 2982.5887 2994.8379 3008.2569 3067.2360 3077.4761 3088.8556 3090.0975 3096.7555 3121.7925 3525.3041 3532.2114 3538.9739 3556.7291 3561.0160
redmass: 3.4389 2.2146 4.5868 5.7957 4.3924 5.8302 6.4458 4.6227 2.6643 1.5867 2.1615 1.2445 1.3755 3.3988 3.4115 2.5415 4.1907 4.3219 3.7006 1.2564 4.2932 3.0869 1.3817 3.7180 3.5926 3.0628 1.6252 1.3986 1.6392 2.9088 3.7379 4.8263 3.1337 3.8315 3.0955 2.7841 2.6406 2.7848 2.5174 5.6258 5.2715 5.5253 1.5701 3.4530 3.6100 2.2450 1.9341 2.5580 2.4284 2.5881 3.2781 2.8149 1.9643 2.9506 2.3498 2.7005 1.9843 1.3210 1.3183 1.2973 1.1818 1.2578 1.2095 1.1560 1.2503 1.2524 1.2592 1.3074 1.2932 1.2661 1.3354 1.3637 1.4133 1.1996 1.5340 1.4611 1.3041 1.2984 1.2931 1.5887 1.0466 1.0557 1.0863 1.0506 1.0502 1.0820 1.0827 1.0828 1.0819 1.0815 1.0697 1.0377 1.0385 1.0848 1.0861 1.0995 1.0990 1.0966 1.0956 1.1009 1.0658 1.0653 1.0656 1.0656 1.0656
irintensity: 2.0697 8.9044 1.1362 2.5792 6.7698 3.4954 1.7145 2.1458 0.2944 31.1774 34.2741 108.1582 4.0309 6.5065 5.2231 1.5113 5.1072 2.1911 5.7502 63.9361 22.6618 9.6086 104.6064 17.0537 10.6822 22.8219 177.6522 76.2482 109.9554 10.5622 36.6165 13.2565 7.1649 22.6750 0.1219 13.4606 23.6479 25.8327 71.2841 208.7001 216.3688 105.1049 38.9940 9.1582 63.3308 30.3465 22.9607 1.0476 106.0909 59.8071 25.3722 41.2380 34.9228 70.2407 7.1234 41.5269 17.4322 16.5407 5.8889 29.8407 25.1265 44.8966 18.3849 14.6303 23.2542 20.0547 17.2263 1.5730 33.5278 20.7945 12.3293 31.2914 6.2599 23.0328 2.6650 3.5196 22.6829 48.7741 6.4329 17.8694 13.3104 12.5986 4.8639 10.2765 12.8459 4.5186 5.4735 67.1485 113.5981 18.5015 64.3017 20.6926 28.4594 26.8192 14.5310 27.0059 17.7307 48.2648 20.1230 18.4303 10.7951 13.7261 16.2913 19.3549 1.9713
temp: 298.150 k
press: 1.00000 atm
elementType: 8 8 8 8 8 8 8 6 6 6 6 6 6 6 6 6 6 1 1 1 1 1 1 1 1 1 1 1 1 1 1 1 1 1 1 1 1
symmnumber: 1
zpe: 794390.9 jmol-1
zpe.correction: 0.302567 hartree
zpe.thermalcorrener: 0.321955 hartree
zpe.thermalcorrenthalpy: 0.322899 hartree
zpe.thermalcorrgfe: 0.254571 hartree
zpe.sumelectzpe: -918.168768 hartree
zpe.sumelectthermal: -918.149381 hartree
zpe.sumelectthermalent: -918.148436 hartree
zpe.sumelectthermalfe: -918.216764 hartree
dipole: 1.4357 -1.5174 3.6670
dipole: 4.2203
quadrupole: -96.3227 -114.7238 -103.0677
quadrupole: -2.6628 -4.8044 -3.0140
quadrupole: 8.3820 -10.0191 1.6370 -2.6628 -4.8044 -3.0140
hfenergy: -918.4713356 hartree
pointgroup: C01 [X(C10H20O7)]
dipole: 0.5874095 -0.4393645 1.4895637 debye
polarizability: 158.0024025|3.0117668|136.5725248|-4.0271528|-4.2658904|107.972694 unknown
InChI: InChI=1S/C10H20O7/c1-4(12)5(2)16-10-9(15)8(14)7(13)6(3-11)17-10/h4-15H,3H2,1-2H3
charge 0 multiplicity 1
37 atoms
O  0.333593 0.853083 -0.122512
O  -1.491232 -0.604713 -0.041984
O  2.931544 -2.411978 -0.463797
O  4.076112 0.257087 -0.051969
O  0.289292 -2.809478 0.604974
O  1.081457 3.529684 0.246974
O  -4.2939 -0.234199 -0.979941
C  2.189434 -1.317555 0.167126
C  2.642394 0.05447 -0.357166
C  0.701074 -1.597765 -0.103377
C  1.739799 1.156608 0.232613
C  -0.1676 -0.44577 0.427231
C  1.997158 2.554389 -0.342983
C  -2.55478 -0.04047 0.833596
C  -3.6085 0.675171 -0.049685
C  -3.126092 -1.187908 1.683109
C  -3.009998 1.789772 -0.912028
H  2.350628 -1.340455 1.272539
H  2.601179 0.075262 -1.45997
H  0.541396 -1.690266 -1.196959
H  1.844186 1.18444 1.344343
H  -0.108729 -0.399546 1.541181
H  1.889864 2.514607 -1.447501
H  3.014196 2.89521 -0.092931
H  -2.105819 0.736977 1.488206
H  -4.354001 1.106139 0.660539
H  3.893647 -2.167436 -0.462122
H  4.183166 0.373061 0.928883
H  0.888145 -3.541385 0.305428
H  -3.966374 -0.839246 2.312394
H  -3.473324 -2.016568 1.038858
H  -2.345911 -1.610569 2.339323
H  -2.203229 1.383622 -1.542067
H  -2.598736 2.59615 -0.276187
H  -3.794314 2.21813 -1.558121
H  0.162474 3.182488 0.100599
H  -4.565798 -1.05724 -0.500315
