program: Gaussian 09
title: 000127221
version: EM64L-G09RevD.01
frameworkgroup: C1[X(C17H23NO11)]
method: RPBEPBE
basis: SDD
operation: Freq
keyword: #p
keyword: freq=noraman
keyword: PBEPBE/SDD
title: #p freq=noraman PBEPBE/SDD
converged: NO YES NO NO
title: Mulliken charges:
elementType: O O O O O O O O O O O N C C C C C C C C C C C C C C C C C H H H H H H H H H H H H H H H H H H H H H H H
charge: -0.270328 -0.275367 -0.465155 -0.464712 -0.462931 -0.256638 -0.245601 -0.430318 -0.509784 -0.390429 -0.264167 -0.014290 -0.096097 -0.166398 0.015541 -0.160182 -0.005862 -0.354912 -0.489627 0.461949 0.254148 0.333055 -0.563644 0.040088 -0.538150 -0.586751 0.018956 -0.820786 0.244607 0.227744 0.225298 0.223551 0.249457 0.195146 0.247778 0.267977 0.369939 0.371515 0.366404 0.283642 0.207032 0.253038 0.260464 0.264794 0.292522 0.271783 0.230259 0.280291 0.229043 0.374960 0.384812 0.386341
chargesum: 0.00000
title: Mulliken charges with hydrogens summed into heavy atoms:
elementType: O O O O O O O O O O O N C C C C C C C C C C C C C C C C C
charge: -0.270328 -0.275367 -0.095216 -0.093197 -0.096526 -0.256638 -0.245601 -0.055359 -0.124972 -0.004089 -0.264167 -0.014290 0.131646 0.058901 0.239091 0.089275 0.189284 0.160843 0.001047 0.461949 0.254148 0.333055 -0.310605 0.040088 -0.012892 -0.022447 0.018956 -0.081193 0.244607
polarizability: 2.86398417e+02 -8.78170582e+00 2.46194329e+02 1.80276407e+01 1.60745658e+01 1.67236156e+02
1716.lowfreq: -6.2696 -5.7146 -1.6051 0.0003 0.0004 0.0008 18.7326 24.9676 31.0052
frequency: 17.9117 24.8145 30.9585 38.3628 50.6417 60.1485 62.4388 72.4146 85.7730 90.3622 101.4948 106.8038 109.0071 131.6271 135.1016 160.3408 165.9483 172.8021 185.8933 206.8786 212.6665 223.1715 242.9119 269.4167 275.8524 285.1004 297.7038 302.6032 308.6664 323.6093 350.3128 363.1317 382.5353 390.1925 403.7068 406.1452 410.3824 425.0988 433.9246 443.1735 463.9900 494.5339 507.8335 515.6103 526.5654 535.0517 550.9569 563.7571 571.6204 580.1649 587.1268 595.7180 603.6035 631.4210 659.7837 680.8490 728.6688 767.5267 789.3781 846.1722 859.3321 864.5218 872.9990 881.6766 917.9033 924.2876 928.5480 929.4270 939.2664 952.2016 965.9923 979.5533 992.1168 1013.8715 1026.5399 1040.1099 1041.4580 1042.5440 1059.7213 1065.7615 1072.8056 1076.9847 1093.3190 1110.3624 1128.9521 1143.3358 1171.3530 1173.8431 1195.5155 1200.5568 1210.3845 1216.1471 1221.3662 1228.4522 1234.5654 1254.1734 1257.8965 1275.1978 1287.6694 1294.0518 1297.7048 1306.1580 1314.8191 1335.7990 1341.2659 1343.4926 1344.2709 1366.1778 1370.0712 1376.9815 1379.1632 1385.3648 1387.2487 1393.9528 1396.9200 1399.3179 1428.1673 1454.3960 1458.1314 1477.5825 1479.0285 1485.7833 1496.4394 1559.6641 1598.7693 1641.3675 1664.8420 2904.8714 2954.9443 2957.4494 2962.3614 2980.8506 2993.1759 3005.0657 3028.9705 3033.8597 3034.9200 3046.1301 3077.0115 3100.5789 3113.4291 3114.3464 3117.8356 3122.1265 3413.1556 3513.9083 3546.0815 3562.5708 3564.9631 3583.8364
redmass: 6.1162 6.6214 5.9094 6.3382 7.7146 5.9244 9.4760 7.9912 4.8041 5.7413 6.8811 6.0384 5.1439 4.9301 5.5788 1.1286 5.4107 4.9375 5.8318 6.1132 5.4943 4.6729 4.6968 4.1434 3.6067 2.6437 3.2589 1.7143 3.2651 1.9628 2.8735 4.4277 3.7387 2.8136 4.7159 1.7087 2.3488 1.4848 1.4865 2.0568 4.3166 5.5253 3.7067 3.3201 4.1583 3.7692 4.1867 2.7228 2.1780 2.0893 4.1222 3.5608 3.6980 5.1034 1.5442 5.3697 5.5946 5.2184 4.9982 4.2062 3.9260 3.4328 4.6010 6.0399 1.8051 2.5468 5.4063 2.6374 3.8113 4.3788 4.6390 3.7181 2.0739 1.8127 2.9337 3.9320 1.5826 3.0701 2.8791 2.6063 2.8314 3.0771 1.9442 3.3978 3.7066 2.5164 1.4102 1.3523 1.1882 1.4971 1.2047 2.3016 1.1456 1.3440 1.1452 1.2335 3.5590 1.2227 1.2006 1.5379 1.5332 1.2354 1.1969 1.3118 1.3559 2.9855 2.5020 1.3832 1.2137 1.7481 1.4379 1.5347 1.5428 1.3869 2.0163 1.9420 1.1537 1.3728 1.0836 1.0771 1.4120 1.3871 1.0853 7.0048 7.1130 8.2867 9.3788 1.0830 1.0821 1.0402 1.0822 1.0855 1.0603 1.0852 1.0978 1.0574 1.0579 1.0588 1.1056 1.1079 1.1075 1.0942 1.1026 1.0917 1.0688 1.0639 1.0657 1.0657 1.0657 1.0655
irintensity: 0.4480 0.6686 0.6558 0.3526 1.0772 2.6191 0.9731 3.0085 7.0315 0.9003 1.5639 6.2055 3.5497 5.3049 1.5223 0.4297 2.8763 6.0737 10.6211 24.9884 6.9797 1.4580 5.1912 4.0651 11.8492 3.8306 22.5853 48.5169 11.1339 25.7186 57.1510 1.7041 13.2352 1.2517 13.3615 83.0855 19.9568 44.4709 204.1699 129.4949 5.7821 9.4955 15.5232 18.8434 7.5793 13.5695 37.1961 40.8236 114.6350 158.4713 42.5978 28.4113 15.7608 7.8576 139.7425 12.2225 19.2829 10.3040 15.7881 5.7745 28.2653 13.3027 35.4841 2.8415 10.6743 20.3564 193.3975 69.7172 84.7608 98.5554 137.8610 63.4100 10.7969 15.6740 86.7497 10.3662 17.0223 118.8185 127.3289 24.3388 24.5892 47.9337 340.0437 3.4655 270.3882 5.2173 179.6368 22.2161 6.5905 28.5005 14.5364 23.2390 20.5880 22.8502 17.1060 7.5020 2.8147 9.8699 15.5043 46.6939 47.7750 78.6070 3.8831 11.4345 42.1236 58.4683 76.0394 5.1993 33.0459 4.5451 46.8627 14.6996 37.2087 0.9882 22.8897 32.3160 41.3579 8.6641 24.1478 17.3491 7.6401 5.9902 4.7582 7.2974 14.6714 224.8523 235.2736 42.2302 12.3862 28.3235 3.6086 54.8381 45.4987 58.4846 21.4856 15.1655 8.5393 1.5760 2.8387 5.3418 4.7293 4.3641 0.2180 19.5771 413.3214 34.9088 23.4457 23.4012 19.2339 42.9275
temp: 298.150 k
press: 1.00000 atm
elementType: 8 8 8 8 8 8 8 8 8 8 8 7 6 6 6 6 6 6 6 6 6 6 6 6 6 6 6 6 6 1 1 1 1 1 1 1 1 1 1 1 1 1 1 1 1 1 1 1 1 1 1 1
symmnumber: 1
zpe: 1048649.1 jmol-1
zpe.correction: 0.399409 hartree
zpe.thermalcorrener: 0.429350 hartree
zpe.thermalcorrenthalpy: 0.430294 hartree
zpe.thermalcorrgfe: 0.337225 hartree
zpe.sumelectzpe: -1541.558691 hartree
zpe.sumelectthermal: -1541.528751 hartree
zpe.sumelectthermalent: -1541.527807 hartree
zpe.sumelectthermalfe: -1541.620875 hartree
dipole: 0.7207 0.9139 -0.5842
dipole: 1.3023
quadrupole: -156.3875 -159.3095 -166.4185
quadrupole: 12.5572 11.2232 -5.0435
quadrupole: 4.3177 1.3957 -5.7133 12.5572 11.2232 -5.0435
hfenergy: -1541.9581005 hartree
pointgroup: C01 [X(C17H23N1O11)]
dipole: -0.0807192 0.4543081 -0.222691 debye
polarizability: 273.044046|21.3977118|258.921387|-1.8087667|24.8082368|167.8634694 unknown
InChI: InChI=1S/C17H23NO11/c1-7-13(23)9(4-19)8(3-18-7)5-28-17-16(26)15(25)14(24)10(29-17)6-27-12(22)2-11(20)21/h3,10,14-17,19-20,23-26H,2,4-6H2,1H3
charge 0 multiplicity 1
52 atoms
O  -0.844173 -1.400826 0.045413
O  1.39291 -1.853061 -0.569475
O  -3.78987 -3.634716 0.510348
O  -1.585546 -5.45369 0.815962
O  0.803725 -4.720166 -0.639088
O  -3.172595 0.414204 -0.293259
O  -2.422007 1.86066 1.390295
O  3.09307 2.939562 1.558581
O  0.197886 1.942542 -0.750734
O  -3.342666 4.86181 -0.089084
O  -1.108353 4.392631 -0.448173
N  5.122864 0.730656 -0.641427
C  -2.401586 -3.200999 0.668641
C  -1.437261 -4.218925 0.040171
C  -2.253929 -1.834802 -0.0418
C  0.005695 -3.700742 0.049853
C  0.05799 -2.34001 -0.666726
C  -3.108821 -0.761375 0.617688
C  1.699072 -0.708927 -1.502559
C  2.748979 0.16236 -0.859944
C  2.387905 1.175804 0.071431
C  -2.75667 1.644509 0.208984
C  4.113879 -0.010132 -1.18363
C  3.439258 1.938622 0.631816
C  0.933771 1.432704 0.430927
C  -2.818373 2.67031 -0.925741
C  4.796693 1.69805 0.263508
C  5.92627 2.51346 0.860077
C  -2.307888 4.024014 -0.479308
H  -2.142561 -3.096672 1.744483
H  -1.734956 -4.399505 -1.017163
H  -2.557372 -1.949763 -1.105356
H  0.36133 -3.550048 1.090035
H  -0.284186 -2.426816 -1.72659
H  -2.684665 -0.446503 1.587176
H  -4.138989 -1.132134 0.740649
H  -3.837987 -4.579443 0.810827
H  -0.912104 -6.101762 0.484994
H  1.746591 -4.414526 -0.646663
H  0.773888 -0.135486 -1.683722
H  2.071765 -1.146336 -2.448594
H  4.419811 -0.776148 -1.906253
H  0.861904 2.140519 1.27278
H  0.439658 0.487268 0.708569
H  -2.184402 2.287554 -1.741382
H  -3.859375 2.750381 -1.27873
H  5.840267 3.591698 0.61552
H  6.876518 2.148835 0.441699
H  5.980034 2.413191 1.963198
H  3.899868 3.412223 1.881402
H  0.076905 2.930452 -0.674829
H  -2.973072 5.724892 0.243703
