program: Gaussian 09
title: 000126982
version: EM64L-G09RevD.01
frameworkgroup: C1[X(C11H16N2O4)]
method: RPBEPBE
basis: SDD
operation: Freq
keyword: #p
keyword: freq=noraman
keyword: PBEPBE/SDD
title: #p freq=noraman PBEPBE/SDD
converged: YES YES NO NO
title: Mulliken charges:
elementType: O O O O N N C C C C C C C C C C C H H H H H H H H H H H H H H H H
charge: -0.273554 -0.260128 -0.198586 -0.200094 -0.549844 0.016671 -0.561225 -0.101482 0.481297 -0.014074 -0.553872 -0.688630 0.325825 0.364811 -0.524812 -0.517829 -0.534734 0.219877 0.198776 0.216312 0.254549 0.235669 0.206859 0.228947 0.300445 0.260738 0.265331 0.207039 0.261391 0.235553 0.224141 0.252722 0.221911
chargesum: 0.00000
title: Mulliken charges with hydrogens summed into heavy atoms:
elementType: O O O O N N C C C C C C C C C C C
charge: -0.273554 -0.260128 -0.198586 -0.200094 -0.023775 0.016671 -0.142572 0.114830 0.481297 -0.014074 -0.299323 -0.017156 0.325825 0.364811 -0.224367 0.186154 0.164041
polarizability: 1.92159421e+02 -3.82504287e-01 1.89498692e+02 -1.56767958e+01 5.54874101e+00 1.02462423e+02
1716.lowfreq: -4.4403 -0.0005 -0.0003 0.0007 3.6893 6.2965 36.4989 44.4906 50.2547
frequency: 36.4563 44.4578 50.2521 60.8834 75.0020 98.1454 132.4528 145.5675 171.9689 179.0914 192.4636 209.5416 221.0398 239.6221 263.2623 268.1153 277.2374 317.4372 329.7059 358.0681 388.2237 395.3739 437.0745 458.3543 498.4717 510.3679 569.7717 597.3191 620.7379 635.6494 676.6343 703.2410 729.2105 768.1795 828.2443 869.9407 880.1212 889.1041 898.1856 935.7914 939.5741 949.3638 991.0428 1021.7710 1076.3679 1102.3965 1110.9519 1113.3835 1134.5797 1149.9738 1159.9593 1178.9550 1189.6341 1216.4724 1231.2991 1235.5300 1280.1965 1289.5362 1330.4891 1361.4343 1366.7462 1370.3976 1391.1122 1407.8150 1428.4164 1440.9448 1448.6376 1450.6837 1465.8445 1468.0010 1469.3922 1471.1075 1478.3879 1481.7602 1569.5661 1611.0250 1635.4379 2962.4234 2971.0610 2973.5270 2983.1110 2986.5073 3051.5672 3068.7807 3081.8467 3086.2995 3104.1536 3131.2756 3131.4959 3148.4884 3190.0309 3446.6628 3576.1578
redmass: 3.6878 3.8037 5.7482 4.4406 3.4935 4.0226 1.5402 1.7913 5.1699 1.7821 2.1341 1.7167 2.3051 3.5219 1.1376 1.7388 3.8024 7.2834 2.9628 7.6312 2.2049 5.2963 2.2085 5.8284 3.8074 5.9225 1.6664 2.8896 4.7671 4.5218 4.9517 9.3086 8.1281 4.8983 2.5398 2.5111 1.9336 1.6694 1.9815 2.1746 4.4428 7.2498 1.4670 3.3258 1.9497 1.2314 2.5120 1.2711 1.8803 1.3295 1.4523 1.8793 2.5323 2.9296 2.9578 1.3713 2.9122 1.6830 1.2397 1.7977 4.5609 4.2347 1.2687 2.2029 1.5359 1.3228 1.1263 1.0658 1.3819 1.1174 1.0526 1.0573 1.5377 1.0705 8.2432 6.5151 1.0970 1.0332 1.0842 1.0350 1.0624 1.0394 1.1041 1.0978 1.0967 1.0974 1.1006 1.1044 1.0993 1.0906 1.0924 1.0443 1.0978
irintensity: 1.4962 0.4700 0.0627 0.4135 2.5200 2.3205 2.5807 1.5104 2.3380 1.1619 2.7430 1.8708 0.9484 3.4995 47.1843 4.3028 13.0931 1.5909 3.2923 1.0974 11.0811 5.9809 4.6365 5.6920 7.2030 0.6235 276.3210 80.1431 24.7958 13.7187 8.6879 15.4694 10.2629 21.1840 4.4432 21.5198 6.8241 27.5460 3.3640 18.7424 39.6641 16.0758 9.5487 83.9580 33.8140 2.9833 19.5187 0.7924 14.3782 1.5878 13.5574 32.6622 155.4718 35.4525 252.9149 7.8953 58.5151 41.3415 13.5776 5.5358 99.7592 15.9765 22.6517 64.6339 5.1015 17.6773 6.3371 7.3092 141.4238 72.3120 20.1100 4.7019 32.8294 7.8229 14.0063 74.9700 44.2519 53.2768 21.2487 63.3835 51.1254 17.0665 44.4067 11.6126 42.1686 24.5550 31.3465 16.3929 20.0516 7.9418 7.2005 3.3279 0.3160
temp: 298.150 k
press: 1.00000 atm
elementType: 8 8 8 8 7 7 6 6 6 6 6 6 6 6 6 6 6 1 1 1 1 1 1 1 1 1 1 1 1 1 1 1 1
symmnumber: 1
zpe: 687089.2 jmol-1
zpe.correction: 0.261698 hartree
zpe.thermalcorrener: 0.280153 hartree
zpe.thermalcorrenthalpy: 0.281097 hartree
zpe.thermalcorrgfe: 0.214660 hartree
zpe.sumelectzpe: -837.736753 hartree
zpe.sumelectthermal: -837.718298 hartree
zpe.sumelectthermalent: -837.717354 hartree
zpe.sumelectthermalfe: -837.783791 hartree
dipole: 5.2985 2.9190 -3.8856
dipole: 7.1898
quadrupole: -116.4396 -87.5682 -101.4335
quadrupole: -4.7692 -2.6724 2.6137
quadrupole: -14.6258 14.2456 0.3802 -4.7692 -2.6724 2.6137
hfenergy: -837.9984516 hartree
pointgroup: C01 [X(C11H16N2O4)]
dipole: -2.1995953 0.7535701 1.6110013 debye
polarizability: 191.0807839|1.0044033|190.0491818|-17.031893|-5.7937647|102.9905693 unknown
InChI: InChI=1S/C11H16N2O4/c1-7(12)4-8-5-9(16-2)6-10(13(14)15)11(8)17-3/h5-7H,4,12H2,1-3H3
charge 0 multiplicity 1
33 atoms
O  0.331919 -2.127772 0.101498
O  0.411082 3.522254 0.161708
O  3.557792 0.010588 -1.35504
O  3.114426 -1.732458 0.040402
N  -4.463822 -1.265772 -0.111065
N  2.802622 -0.606818 -0.507616
C  -2.132788 -0.771624 0.772161
C  -3.149911 -0.679091 -0.431976
C  -0.835019 -0.026859 0.519154
C  0.366148 -0.72672 0.211394
C  -0.837755 1.391469 0.52273
C  -2.593136 -1.353606 -1.6997
C  1.522004 0.037977 -0.1348
C  0.323939 2.125858 0.185196
C  1.507604 1.44409 -0.166927
C  0.67222 -2.889615 1.328098
C  -0.795678 4.28592 0.492307
H  -1.938439 -1.841568 0.961558
H  -2.63535 -0.350691 1.666085
H  -3.310592 0.397437 -0.647572
H  -1.76609 1.90777 0.788573
H  -3.317066 -1.25362 -2.526092
H  -2.407381 -2.429784 -1.519498
H  -1.634761 -0.902097 -2.006173
H  2.400993 1.999714 -0.460585
H  -4.92704 -0.869124 0.713055
H  -4.470833 -2.291159 -0.103436
H  -0.004114 -2.610466 2.15956
H  1.724174 -2.709863 1.602251
H  0.525456 -3.945973 1.057362
H  -1.616418 4.067972 -0.218267
H  -0.498722 5.34061 0.40295
H  -1.131363 4.07962 1.527207
