program: Gaussian 09
title: 000126987
version: EM64L-G09RevD.01
frameworkgroup: C1[X(C12H22O11)]
method: RPBEPBE
basis: SDD
operation: Freq
keyword: #p
keyword: freq=noraman
keyword: PBEPBE/SDD
title: #p freq=noraman PBEPBE/SDD
converged: YES YES NO NO
title: Mulliken charges:
elementType: O O O O O O O O O O O C C C C C C C C C C C C H H H H H H H H H H H H H H H H H H H H H H
charge: -0.293596 -0.280270 -0.270771 -0.428155 -0.423949 -0.429937 -0.461893 -0.459834 -0.440520 -0.384197 -0.436728 0.397960 -0.218312 -0.220365 -0.086577 -0.063823 -0.210548 -0.291578 -0.163225 -0.393068 -0.104494 -0.058977 -0.366721 0.254530 0.282185 0.223090 0.195587 0.323216 0.202066 0.237611 0.198175 0.229894 0.210513 0.223251 0.221838 0.260982 0.221380 0.354439 0.334537 0.326886 0.367021 0.355634 0.367118 0.354769 0.344857
chargesum: 0.00000
title: Mulliken charges with hydrogens summed into heavy atoms:
elementType: O O O O O O O O O O O C C C C C C C C C C C C
charge: -0.293596 -0.280270 -0.270771 -0.073716 -0.089411 -0.103051 -0.094872 -0.104200 -0.073403 -0.029429 -0.091872 0.397960 0.036218 0.061820 0.136513 0.131764 0.112668 0.148098 0.034950 0.047339 0.118757 0.162861 0.115642
polarizability: 1.75898525e+02 -2.11838487e-01 1.71396965e+02 1.00312547e+00 7.12989034e+00 1.49436261e+02
1716.lowfreq: -12.6910 -7.6255 -0.0009 -0.0007 -0.0005 7.9103 13.3088 24.6725 36.3846
frequency: 10.2344 24.6276 36.3163 48.6154 64.6337 75.7130 80.3257 92.8200 104.5029 104.9898 135.4024 140.3283 151.1019 170.4761 194.5038 208.1300 214.3263 220.2494 233.9965 251.6684 258.4161 281.0110 282.8880 291.5927 320.3903 323.7118 339.0461 342.1092 364.8357 390.6638 391.3400 397.1411 405.1579 419.9861 435.1526 450.2488 452.9219 475.3287 509.1282 533.6340 538.0355 563.1921 564.6446 581.9361 598.4168 633.1620 681.8014 760.2203 809.6271 857.0160 863.1815 901.2923 928.7554 934.7231 945.9177 955.1999 968.1039 983.9433 999.1047 1002.5667 1008.6983 1013.2559 1022.6520 1030.5458 1053.5165 1057.9536 1064.8117 1092.2053 1094.9969 1097.3015 1104.8229 1120.4687 1125.2335 1131.8133 1168.0397 1178.1146 1190.2986 1194.1800 1209.4048 1213.4072 1224.3618 1238.5188 1240.7627 1251.5680 1256.7387 1273.5038 1286.4103 1291.7775 1295.2563 1319.5412 1322.6408 1338.8077 1342.8994 1344.2555 1351.0401 1367.9361 1371.4548 1374.9434 1380.1385 1385.0904 1385.8507 1403.4012 1404.5152 1409.7869 1452.1175 1456.5968 1471.8525 2887.7795 2903.8643 2948.3722 2959.2025 2970.7535 2976.2363 2981.4871 2996.2917 3019.3440 3026.1621 3053.0081 3079.5477 3081.4014 3094.6435 3512.9592 3531.4902 3534.8554 3547.6461 3550.8248 3556.4953 3557.8958 3591.3146
redmass: 6.4137 6.8880 6.5460 6.7998 6.3842 5.3128 4.5170 5.7047 6.4747 3.5091 1.2558 5.7575 3.5163 3.1987 2.8716 2.9455 3.2698 3.3005 3.1720 4.2474 3.0773 3.9298 3.0157 1.3790 2.4959 1.9735 1.8121 2.5469 1.2953 4.6758 2.5708 2.1296 3.1315 3.7283 1.1382 1.3630 2.7687 6.1342 4.2683 3.6557 4.6262 4.3683 4.4548 4.1662 3.7120 4.7935 3.8176 3.9037 2.8962 3.7979 3.5586 3.9833 6.4738 4.9784 4.5717 4.3523 3.2687 4.2639 4.6422 3.5243 3.5429 5.5534 2.8955 2.4024 2.6262 2.6637 3.3240 3.2026 3.1777 2.7165 2.3447 2.4490 2.4993 1.4717 1.3399 1.2175 1.2841 1.3294 1.3304 1.2106 1.2802 1.2081 1.1799 1.2041 1.1783 1.3102 1.3422 1.3449 1.2228 1.3807 1.3835 1.3400 1.2187 1.4718 1.7249 1.2939 1.3190 1.2212 1.5445 1.3062 1.2155 1.4793 1.4759 1.7670 1.0819 1.0782 1.0819 1.0811 1.0811 1.0834 1.0566 1.0830 1.0600 1.0817 1.0660 1.0863 1.1054 1.1022 1.1022 1.0864 1.0867 1.0657 1.0658 1.0655 1.0657 1.0659 1.0658 1.0658 1.0669
irintensity: 0.1787 0.4443 0.2955 0.4588 4.8671 4.4373 7.8141 4.3329 4.8748 24.4295 117.2438 11.0066 9.2266 4.8075 20.1548 29.9529 49.5196 9.5065 6.0085 4.1384 2.8056 8.0967 1.2031 63.0205 12.0594 45.3376 91.7445 56.1198 187.5246 17.2120 32.1193 38.7949 16.8655 6.2631 203.2474 180.9623 44.0933 13.3761 17.7706 27.4233 15.0948 21.7360 25.2852 9.8967 2.4338 2.2550 25.6110 24.4924 24.7830 50.6689 159.9348 15.1209 331.0200 92.9383 97.8702 53.1545 198.3152 122.2649 26.8322 34.1263 74.3329 5.1792 39.0827 21.0340 55.0526 53.0757 41.3861 6.5025 91.9994 76.0115 68.5109 11.1900 23.6863 33.4955 15.1258 7.6058 36.4281 32.3744 45.3380 7.0171 15.3623 22.3069 10.3988 5.3647 0.9887 9.9396 35.2394 2.2522 25.1859 11.5457 6.0395 15.3969 15.8920 17.7258 8.1275 2.9552 29.1612 17.3668 13.6451 33.2710 6.1003 25.5599 6.2718 4.8578 12.0203 4.4290 2.7867 29.7991 65.6670 47.3193 25.8638 15.0838 84.2531 34.3138 19.4943 49.5603 26.8492 13.7380 15.0669 12.2862 2.3931 5.7761 6.3132 23.0008 18.8463 11.0345 5.9115 16.6675 5.8950
temp: 298.150 k
press: 1.00000 atm
elementType: 8 8 8 8 8 8 8 8 8 8 8 6 6 6 6 6 6 6 6 6 6 6 6 1 1 1 1 1 1 1 1 1 1 1 1 1 1 1 1 1 1 1 1 1 1
symmnumber: 1
zpe: 927545.9 jmol-1
zpe.correction: 0.353284 hartree
zpe.thermalcorrener: 0.379219 hartree
zpe.thermalcorrenthalpy: 0.380163 hartree
zpe.thermalcorrgfe: 0.296418 hartree
zpe.sumelectzpe: -1295.972374 hartree
zpe.sumelectthermal: -1295.946439 hartree
zpe.sumelectthermalent: -1295.945495 hartree
zpe.sumelectthermalfe: -1296.029240 hartree
dipole: -0.7545 -5.6320 -1.4663
dipole: 5.8685
quadrupole: -128.5933 -149.3277 -126.7921
quadrupole: -2.9269 -8.2866 17.7855
quadrupole: 6.3110 -14.4233 8.1123 -2.9269 -8.2866 17.7855
hfenergy: -1296.3256577 hartree
pointgroup: C01 [X(C12H22O11)]
dipole: -0.0882306 2.1826862 0.7475411 debye
polarizability: 175.8888184|-0.0696788|170.1660886|-0.6500557|8.7874751|150.6768444 unknown
InChI: InChI=1S/C12H22O11/c13-1-4-7(16)10(19)12(3-14,23-4)21-2-5-6(15)8(17)9(18)11(20)22-5/h4-11,13-20H,1-3H2
charge 0 multiplicity 1
45 atoms
O  -2.571779 -0.079545 0.970752
O  -0.564986 1.108109 0.315358
O  1.288701 -1.020296 0.707453
O  -1.715084 1.84104 -2.03556
O  -2.944637 -1.027306 -2.587766
O  2.614871 2.529194 0.962165
O  4.284073 1.270772 -1.135208
O  -3.982421 2.477948 0.771632
O  4.56351 -1.542428 -1.005534
O  2.216258 -3.029243 -0.073402
O  -2.564279 -2.950051 1.634444
C  -2.026663 1.12609 0.322053
C  -2.468332 0.97719 -1.146663
C  -2.262578 -0.534761 -1.389753
C  -2.73821 -1.167576 -0.06191
C  1.479234 0.315023 1.306865
C  2.286374 1.223821 0.346332
C  0.089228 0.875404 1.609388
C  3.580151 0.522899 -0.089572
C  -2.552909 2.354744 1.070599
C  3.311836 -0.873573 -0.669019
C  2.56137 -1.727584 0.374038
C  -1.976757 -2.409163 0.400929
H  -3.554386 1.210724 -1.185698
H  -1.193985 -0.731317 -1.575628
H  -3.825085 -1.390293 -0.094317
H  2.03718 0.215223 2.271524
H  1.662053 1.485401 -0.522657
H  0.198231 1.827835 2.16686
H  -0.487509 0.145117 2.206382
H  4.245984 0.409348 0.80087
H  -1.985177 3.23557 0.709341
H  -2.381883 2.21442 2.158319
H  2.664737 -0.757634 -1.568524
H  3.164884 -1.872588 1.291237
H  -0.903417 -2.167257 0.532402
H  -2.086734 -3.213212 -0.347184
H  -1.949627 1.590968 -2.965975
H  -3.92592 -0.961613 -2.452925
H  3.138242 2.367674 1.791703
H  4.282057 2.230124 -0.88236
H  -4.354126 3.257574 1.252294
H  5.103288 -0.897172 -1.533759
H  1.893617 -2.996039 -1.010045
H  -2.518793 -2.237759 2.322519
