program: Gaussian 09
title: 000126960
version: EM64L-G09RevD.01
frameworkgroup: C1[X(C6H10O10S)]
method: RPBEPBE
basis: SDD
operation: Freq
keyword: #p
keyword: freq=noraman
keyword: PBEPBE/SDD
title: #p freq=noraman PBEPBE/SDD
converged: YES YES NO NO
title: Mulliken charges:
elementType: S O O O O O O O O O O C C C C C C H H H H H H H H H H
charge: 1.192876 -0.454448 -0.451866 -0.473505 -0.471990 -0.418855 -0.163731 -0.229623 -0.535127 -0.425699 -0.476152 -0.085593 -0.111887 -0.098478 -0.212859 -0.061372 0.172865 0.268204 0.251652 0.309305 0.311077 0.212438 0.375332 0.378388 0.378186 0.404539 0.416323
chargesum: 0.00000
title: Mulliken charges with hydrogens summed into heavy atoms:
elementType: S O O O O O O O O O O C C C C C C
charge: 1.192876 -0.079116 -0.451866 -0.095117 -0.093804 -0.014316 -0.163731 -0.229623 -0.118804 -0.425699 -0.476152 0.182611 0.139765 0.210827 0.098218 0.151066 0.172865
polarizability: 1.48264124e+02 3.02817912e+00 1.32696314e+02 -3.39231995e-01 -7.88559145e+00 1.13739204e+02
1716.lowfreq: -14.5141 -7.4510 -0.0014 -0.0008 -0.0003 5.6544 9.7092 23.1598 45.5634
frequency: -11.9103 22.6863 45.5047 45.8426 61.9275 70.6878 95.0131 101.9391 116.6429 136.5268 150.4885 170.1513 191.0994 221.8301 242.8602 255.4271 280.3054 294.4903 311.8388 312.8591 339.0238 367.6415 389.7830 409.4043 425.6539 469.2844 476.8729 486.2744 524.3757 543.9008 559.2135 593.5969 594.9071 627.8000 683.8564 747.1118 809.6273 840.0445 864.5088 912.0318 931.7021 964.3869 992.8025 995.9433 1015.4892 1040.2481 1067.0580 1074.0142 1089.0348 1120.5553 1199.0305 1202.4472 1243.6762 1252.2733 1268.5806 1291.1156 1294.4458 1300.4463 1325.3573 1350.7477 1368.1354 1380.8215 1399.2050 1643.7102 1649.0839 2952.3191 2980.0924 2988.9554 2999.6465 3013.5849 3432.6488 3477.3158 3497.4617 3520.3163 3533.3070
redmass: 9.0372 11.8732 11.8465 7.3834 5.9835 8.0823 8.7355 8.1433 5.1312 7.0180 3.7224 6.0428 3.6221 4.7385 4.6783 3.8005 2.4427 2.4084 6.2717 8.7480 9.6890 3.9796 2.4226 4.3676 4.1585 2.6933 6.2546 1.2959 4.0717 1.4993 2.7415 3.9480 6.0901 1.6034 5.1350 3.9990 4.7579 4.0478 9.9343 2.3143 5.4298 4.2476 16.7056 5.2648 4.1801 4.6289 2.3289 3.0880 2.5356 1.2024 1.1804 1.1936 1.2036 1.1961 1.3739 1.1937 1.2785 1.3475 1.2629 1.1991 1.5347 1.5563 1.7291 9.3755 9.2282 1.0892 1.0824 1.0842 1.0828 1.0842 1.0654 1.0653 1.0643 1.0644 1.0650
irintensity: 3.4263 0.1831 2.0211 0.9404 0.4236 4.3068 5.3964 4.5785 10.1794 7.9439 29.7982 1.1343 25.5380 15.8352 28.8962 25.7657 44.6266 56.4707 28.9175 3.8780 7.8059 8.7268 58.3454 66.9730 13.8792 24.3276 33.0582 136.2200 17.1492 43.2054 165.6298 17.9057 83.6426 97.4470 81.2296 14.6456 12.5808 85.6499 85.6416 60.0595 5.7077 92.1642 138.3150 157.1430 5.1092 33.1741 142.6833 19.0591 26.4728 93.1100 25.6614 31.0940 26.2308 36.3571 45.9560 35.8969 21.4680 31.9801 25.4463 4.3737 62.9222 5.9437 19.9752 134.6572 260.4397 60.8551 20.0582 9.3656 4.0056 22.8348 76.0253 62.8311 37.9415 49.4024 40.4522
temp: 298.150 k
press: 1.00000 atm
elementType: 16 8 8 8 8 8 8 8 8 8 8 6 6 6 6 6 6 1 1 1 1 1 1 1 1 1 1
symmnumber: 1
zpe: 464444.1 jmol-1
zpe.correction: 0.176897 hartree
zpe.thermalcorrener: 0.196135 hartree
zpe.thermalcorrenthalpy: 0.197080 hartree
zpe.thermalcorrgfe: 0.128101 hartree
zpe.sumelectzpe: -1383.345020 hartree
zpe.sumelectthermal: -1383.325782 hartree
zpe.sumelectthermalent: -1383.324838 hartree
zpe.sumelectthermalfe: -1383.393816 hartree
dipole: 2.2624 -0.2338 0.4582
dipole: 2.3201
quadrupole: -115.0346 -121.9077 -100.4865
quadrupole: -3.1781 -5.9287 -1.0443
quadrupole: -2.5583 -9.4314 11.9897 -3.1781 -5.9287 -1.0443
hfenergy: -1383.5219176 hartree
pointgroup: C01 [X(C6H10O10S1)]
dipole: -0.8995595 0.085822 0.1289847 debye
polarizability: 147.7286591|3.8791748|135.9855374|-0.7832753|-1.610667|110.9854459 unknown
InChI: InChI=1S/C6H10O10S/c7-1-2(16-17(13,14)15)3(8)4(9)5(10)6(11)12/h1-5,8-11,13H
charge 0 multiplicity 1
27 atoms
S  2.509511 1.173317 -0.710699
O  -0.137683 -0.950099 2.45164
O  1.787794 0.109962 0.659968
O  -2.37613 0.450129 1.789202
O  -2.578785 2.187617 -0.251135
O  -1.749336 -1.109984 -1.644453
O  0.860198 -3.365754 0.184231
O  -3.692224 0.1717 -1.687825
O  2.922018 2.446732 0.50207
O  3.85485 0.577087 -1.330544
O  1.311351 1.639783 -1.677071
C  -0.497689 -0.766506 1.043132
C  -1.221492 0.585487 0.894123
C  0.813399 -0.922924 0.251913
C  -1.714765 1.033613 -0.514509
C  1.434045 -2.310785 0.523311
C  -2.510068 0.002432 -1.31536
H  -1.171592 -1.57924 0.707249
H  -0.555024 1.394546 1.258714
H  0.569587 -0.848509 -0.827351
H  -0.84099 1.337456 -1.125731
H  2.423376 -2.285153 1.035201
H  -0.96059 -0.779577 2.98198
H  -2.929619 1.266657 1.65381
H  -3.38389 2.114704 -0.834183
H  -2.273165 -1.754789 -2.192689
H  2.556716 2.110098 1.376305
