program: Gaussian 09
title: 000126971
version: EM64L-G09RevD.01
frameworkgroup: C1[X(C17H20N10)]
method: RPBEPBE
basis: SDD
operation: Freq
keyword: #p
keyword: freq=noraman
keyword: PBEPBE/SDD
title: #p freq=noraman PBEPBE/SDD
converged: YES YES NO NO
title: Mulliken charges:
elementType: N N N N N N N N N N C C C C C C C C C C C C C C C C C H H H H H H H H H H H H H H H H H H H H
charge: -0.157138 -0.184521 -0.059161 -0.066536 -0.034972 0.044201 -0.080481 0.001607 -0.070930 -0.621064 -0.372579 -0.408416 -0.372860 -0.399962 -0.435587 0.198760 0.153456 -0.184219 -0.011541 -0.161036 -0.385893 -0.471447 -0.260167 -0.467064 0.002265 0.160759 -0.362879 0.224100 0.210677 0.234692 0.255161 0.273120 0.220156 0.252887 0.201406 0.302044 0.273930 0.215354 0.219459 0.251778 0.214057 0.267184 0.219616 0.257738 0.243498 0.328420 0.342129
chargesum: 0.00000
title: Mulliken charges with hydrogens summed into heavy atoms:
elementType: N N N N N N N N N N C C C C C C C C C C C C C C C C C
charge: -0.157138 -0.184521 -0.059161 -0.066536 -0.034972 0.044201 -0.080481 0.001607 -0.070930 0.049486 0.062198 0.081437 0.120415 0.054331 -0.133543 0.198760 0.153456 0.089711 -0.011541 -0.161036 0.048920 -0.005611 0.007017 0.010291 0.002265 0.160759 -0.119381
polarizability: 2.50155158e+02 -5.09970040e+00 3.04330946e+02 -4.83252636e+01 7.53709413e-01 1.87990932e+02
1716.lowfreq: -7.3019 -6.6494 0.0002 0.0006 0.0007 7.6079 22.6786 40.1249 46.9320
frequency: 22.3344 40.0979 46.9238 65.8172 76.6033 107.4357 136.3889 139.7723 147.7424 172.4400 183.0060 208.4079 223.4254 227.6544 238.8270 254.2053 264.9525 275.1290 293.6006 304.0424 337.5617 360.1481 366.4148 401.0736 418.7258 464.8397 482.7098 498.1956 505.1768 507.9516 512.5331 536.9048 544.6969 557.0276 574.5865 584.6915 612.4476 620.6980 638.1698 659.9114 669.6598 678.5212 695.3040 699.7747 766.9793 780.2318 786.7861 791.4457 812.8919 824.4523 833.0353 839.3266 862.8759 885.8522 891.1323 897.3384 911.5013 932.8088 944.8871 960.7350 971.4990 1003.1112 1005.0553 1019.9999 1030.2118 1047.0487 1059.5965 1072.6029 1083.4846 1099.0322 1105.3272 1113.3297 1142.0001 1158.9298 1168.1170 1172.2876 1185.1279 1187.8930 1199.4323 1237.3627 1242.5332 1250.9016 1261.9820 1267.0910 1279.9309 1294.4273 1302.7061 1317.3319 1330.2281 1337.6861 1345.2528 1347.7228 1352.5793 1359.6679 1366.8381 1368.2749 1374.2213 1378.0500 1397.6223 1423.4086 1444.8633 1449.6826 1453.0258 1453.9404 1462.0693 1462.7104 1468.2623 1474.9966 1480.3552 1528.3406 1548.1264 1576.4963 1597.2012 1628.6035 1640.1459 2947.3218 2960.5185 2976.4740 2987.2119 2999.7613 3003.4969 3006.3531 3008.2762 3026.0060 3028.4352 3063.0990 3067.3762 3072.3530 3075.9127 3082.3396 3154.8640 3201.8568 3224.5836 3540.3795 3696.2316
redmass: 5.8894 5.7835 5.9903 6.2669 6.3688 5.7410 4.3588 3.8919 4.5979 3.2619 3.6838 5.0536 3.5082 2.7910 3.9085 3.2725 3.0076 2.5012 3.6168 2.9816 3.5138 4.7189 3.1582 4.1174 3.2613 3.9901 4.0257 4.3371 1.2354 5.0508 6.1670 3.2461 1.0957 4.0030 4.2638 5.1074 4.1831 3.4929 4.2857 4.9408 8.4314 5.0893 3.9993 4.1640 3.0842 2.3004 3.3278 3.7439 1.9929 2.5847 3.3531 2.6140 3.4109 2.2797 2.0991 1.8401 2.7436 1.9356 3.0078 2.5868 2.4093 4.6936 3.2319 2.4231 3.2091 2.6382 2.4809 2.4368 2.2151 3.1798 3.2052 4.7706 1.9878 1.4473 1.4556 1.7473 1.3106 1.8572 1.1844 1.7417 2.6438 1.5852 1.3263 1.8187 1.6502 2.3443 1.4810 1.7924 2.1441 1.4295 1.3685 1.7321 1.5573 1.7366 1.3840 3.1424 1.6906 1.6227 4.6846 3.6515 1.2663 3.7570 1.8995 1.1357 1.1006 1.0878 1.1707 1.1259 1.6553 5.8793 5.9530 2.1051 8.8067 2.5091 10.2547 1.0801 1.0576 1.0598 1.0644 1.0627 1.0619 1.0658 1.0608 1.0966 1.0985 1.1029 1.1010 1.1031 1.1035 1.0975 1.0922 1.0978 1.0981 1.0441 1.1056
irintensity: 0.6771 1.6518 0.2815 0.2231 0.2770 2.1310 4.4486 1.9894 5.6363 2.1908 0.4386 0.9482 1.9677 3.4084 0.7787 2.5830 10.4438 7.8681 3.3192 6.4630 0.3948 2.9189 9.0970 0.3516 0.5650 7.8410 5.3793 1.0331 256.0931 4.5733 3.2372 5.5729 0.1272 6.3671 2.3529 33.1538 4.3790 3.1634 44.9372 5.3327 1.9595 9.7021 1.3339 7.6337 3.3698 14.6163 14.4635 11.8999 10.7792 7.5692 8.5900 1.4941 29.1164 5.8088 17.5371 15.5074 4.6545 6.8550 5.9442 12.7623 9.4143 50.8306 16.9855 13.0643 3.8637 11.6017 46.8350 0.0502 3.1715 16.7530 29.7761 45.9562 23.3073 12.2111 13.6108 32.0256 4.3188 13.8663 4.9491 20.7027 8.1999 34.3859 11.9504 21.4457 4.7101 14.6508 17.9901 29.6127 53.6930 10.4743 20.6516 48.4124 7.7059 0.1494 5.1877 28.7095 13.5208 8.2080 10.2249 82.0746 3.0614 193.7603 5.9892 10.8167 22.0004 13.9115 24.7063 29.4135 25.3317 68.2194 102.4974 33.7243 229.0873 568.4915 73.1198 0.3579 19.3038 16.3609 15.7918 13.4527 47.2643 44.4576 42.2359 42.8868 29.2549 17.2574 16.3633 8.1312 27.9746 22.6726 28.2898 2.1054 0.1689 115.2862 43.8441
temp: 298.150 k
press: 1.00000 atm
elementType: 7 7 7 7 7 7 7 7 7 7 6 6 6 6 6 6 6 6 6 6 6 6 6 6 6 6 6 1 1 1 1 1 1 1 1 1 1 1 1 1 1 1 1 1 1 1 1
symmnumber: 1
zpe: 978128.9 jmol-1
zpe.correction: 0.372550 hartree
zpe.thermalcorrener: 0.394609 hartree
zpe.thermalcorrenthalpy: 0.395553 hartree
zpe.thermalcorrgfe: 0.321929 hartree
zpe.sumelectzpe: -1205.348845 hartree
zpe.sumelectthermal: -1205.326786 hartree
zpe.sumelectthermalent: -1205.325842 hartree
zpe.sumelectthermalfe: -1205.399466 hartree
dipole: -2.9827 -5.9038 2.7437
dipole: 7.1610
quadrupole: -164.4715 -142.2890 -155.4752
quadrupole: -11.0365 4.6694 7.3232
quadrupole: -10.3929 11.7896 -1.3966 -11.0365 4.6694 7.3232
hfenergy: -1205.7213951 hartree
pointgroup: C01 [X(C17H20N10)]
dipole: 0.8955608 -2.4932301 -0.958723 debye
polarizability: 247.7862955|7.2228709|302.8123777|-51.0885085|-3.4805877|191.878363 unknown
InChI: InChI=1S/C17H20N10/c18-14-12-17-25-11(24-14)4-3-5-19-15-13-16(21-8-20-15)26(10-23-13)6-1-2-7-27(17)9-22-12/h8-10,13H,1-7,18H2
charge 0 multiplicity 1
47 atoms
N  -2.106654 -1.573985 -1.046643
N  2.051911 -2.025618 0.884707
N  -1.564891 0.435271 -2.070543
N  -3.730004 -0.860217 0.615411
N  1.355046 0.350579 1.107947
N  -1.87478 2.821928 0.125133
N  3.74595 -1.7743 -0.652611
N  -3.665333 1.576626 0.99847
N  2.703732 1.83841 -0.299241
N  4.429029 1.068286 -1.716037
C  -0.59476 -3.307355 -0.031109
C  -1.968627 -2.994513 -0.670603
C  -0.363293 -2.560748 1.299138
C  1.09316 -2.661614 1.808952
C  -2.681945 0.684668 -1.105929
C  -2.948115 -0.656561 -0.4312
C  2.11922 -0.656076 0.594892
C  -1.324196 -0.857162 -1.993549
C  -2.624043 1.77198 0.026647
C  3.169468 -0.524852 -0.352367
C  0.412484 3.745004 0.089147
C  0.968957 2.786909 1.169841
C  3.048643 -2.640278 0.107571
C  -0.728278 3.125168 -0.751503
C  1.709335 1.584247 0.619688
C  3.444165 0.801382 -0.801336
C  -4.16885 0.3658 1.189723
H  0.208986 -3.052151 -0.750083
H  -0.537972 -4.402939 0.127975
H  -2.124939 -3.619699 -1.56975
H  -2.787168 -3.202428 0.041409
H  -0.609892 -1.48908 1.193011
H  -1.034491 -2.964138 2.08153
H  1.174061 -2.160124 2.789938
H  1.401082 -3.716368 1.934294
H  -3.57478 0.989964 -1.697202
H  -0.581777 -1.375345 -2.601817
H  0.026051 4.652457 0.589118
H  1.23179 4.042885 -0.590543
H  0.152504 2.426986 1.817872
H  1.67609 3.355189 1.80662
H  3.22365 -3.713968 0.146928
H  -1.069248 3.891459 -1.478443
H  -0.36954 2.253089 -1.330966
H  -4.963808 0.262366 1.935635
H  4.590265 2.032215 -1.999869
H  4.994607 0.308749 -2.088454
