program: Gaussian 09
title: 000127055
version: EM64L-G09RevD.01
frameworkgroup: C1[X(C19H16O7)]
method: RPBEPBE
basis: SDD
operation: Freq
keyword: #pfreq=noraman
keyword: PBEPBE/SDD
title: #p freq=noraman PBEPBE/SDD
converged: YES YES NO NO
title: Mulliken charges:
elementType: O O O O O O O C C C C C C C C C C C C C C C C C C C H H H H H H H H H H H H H H H H
charge: -0.280225 -0.291832 -0.291093 -0.260094 -0.178045 -0.195880 -0.195605 0.176328 0.302097 0.285031 -0.015013 -0.215157 0.111659 -0.633578 0.297496 -0.430473 0.110794 0.276547 -0.401012 -0.184356 -0.510020 -0.527478 0.269174 0.262172 -0.748520 -0.751147 0.295527 0.286580 0.255167 0.231217 0.234017 0.240084 0.240671 0.234162 0.244779 0.230596 0.264204 0.246944 0.248396 0.276629 0.242028 0.247229
chargesum: 0.00000
title: Mulliken charges with hydrogens summed into heavy atoms:
elementType: O O O O O O O C C C C C C C C C C C C C C C C C C C
charge: -0.280225 -0.291832 -0.291093 -0.260094 -0.178045 -0.195880 -0.195605 0.176328 0.302097 0.285031 -0.015013 -0.215157 0.111659 -0.338050 0.297496 -0.143893 0.110794 0.276547 -0.145846 0.046862 0.204751 0.182059 0.269174 0.262172 0.011024 0.014739
polarizability: 3.64934151e+02 1.73050184e+01 2.72542445e+02 -1.15449949e+01 3.84155792e+00 1.27944058e+02
1716.lowfreq: -6.1809 -5.9089 -0.0010 -0.0007 -0.0002 3.0417 32.2531 39.7974 48.8155
frequency: 32.2427 39.7949 48.8144 55.6570 56.5070 64.7227 68.5566 80.8119 94.4212 100.5748 121.1816 124.3093 129.8487 149.4445 158.6322 182.2798 191.1094 229.7843 236.5035 242.6082 243.0398 264.3155 273.5944 295.3791 312.2239 324.8979 348.0309 370.8216 388.0769 427.9029 455.7254 462.8778 487.2567 498.3884 529.5299 543.5790 546.2695 567.2315 570.3428 596.7785 617.1729 630.7927 669.5143 684.2003 694.6678 725.2338 737.3480 779.7651 787.0802 804.6899 812.4815 833.8606 871.1563 875.4960 890.4874 918.0902 925.1000 977.6552 984.5169 987.6885 994.3302 1029.0373 1036.4630 1037.0983 1059.3454 1083.9527 1110.4898 1114.7215 1116.9711 1148.0278 1154.4357 1157.6612 1160.6298 1172.3850 1178.2322 1191.8505 1224.1530 1262.3654 1307.1509 1365.3892 1378.5844 1381.2529 1388.1307 1412.6037 1425.2459 1446.1930 1449.9664 1450.6503 1451.9050 1452.7368 1455.0807 1457.5585 1463.6535 1467.8653 1473.3094 1476.9127 1479.7774 1583.1881 1594.4011 1600.8512 1615.3605 1628.7075 1690.8554 1699.3131 2973.8778 2988.9677 3008.3201 3008.7815 3067.7828 3097.6806 3098.9590 3103.7795 3123.8151 3134.4774 3142.2360 3142.5772 3143.9899 3172.5859 3172.7902 3188.7499
redmass: 5.5657 4.3583 5.0215 3.9884 3.5952 3.6589 4.4450 5.6802 1.1542 4.1988 1.0736 5.1194 6.4314 9.5756 4.5463 3.7588 2.5824 1.4837 3.2609 1.7892 4.0214 3.2960 4.4117 4.6908 5.1735 5.3279 4.8946 5.0448 7.7761 5.5000 5.8739 4.6407 5.5438 4.7462 3.9383 5.3766 3.3813 6.6230 6.3776 5.5498 5.3638 5.7238 7.2107 5.0426 6.1107 5.2208 3.8015 4.0737 4.0979 3.6552 3.5828 3.1839 7.9342 7.8668 2.1804 1.4347 6.6463 3.3997 2.1597 1.3641 3.4429 4.3737 1.6721 1.6604 2.7203 4.6279 1.2526 1.2625 3.6145 2.6612 2.2536 1.6871 1.4466 1.4424 2.2886 2.7781 2.7039 3.0971 5.9420 8.5104 1.2452 1.2821 3.0467 2.0515 2.3551 1.3858 1.0850 1.0876 1.4267 1.6804 1.0802 1.9529 1.1090 1.0490 1.1515 1.2539 2.4150 8.8472 7.8098 10.5545 8.5766 11.2420 10.5315 10.8375 1.0321 1.0304 1.0372 1.0370 1.1046 1.0961 1.1037 1.0953 1.1045 1.1008 1.0884 1.1022 1.1017 1.0919 1.0945 1.0959
irintensity: 1.3314 0.4599 3.6390 4.4193 4.9620 1.2213 6.0087 0.8782 0.1732 3.0993 0.3028 4.0917 3.3629 2.1822 5.1813 2.2342 2.1501 0.6596 1.6124 0.5016 0.6594 1.4176 2.0881 2.0413 1.5017 0.9511 2.5251 3.5674 1.5467 11.5924 0.8187 1.8710 4.1082 23.1461 6.1246 1.7530 11.9416 4.2188 1.0977 8.1982 8.1110 9.8988 21.6909 13.9097 27.0193 5.5844 7.8656 28.2194 21.5479 65.8586 44.9577 60.0425 8.6615 109.8338 12.0096 1.4461 79.6642 25.9285 181.8251 2.4338 72.1314 10.0398 4.3204 6.6148 25.4325 146.0554 4.6903 2.1585 368.9351 457.6821 126.0378 106.0606 40.2782 42.8332 59.4260 9.7186 20.8590 57.6684 363.7148 7.1188 92.4844 82.0575 32.3363 110.3475 75.6886 46.1315 27.9378 22.1254 36.6516 25.3481 23.6137 36.3524 15.8199 14.9583 67.1564 22.1774 1.9230 97.3162 34.1340 249.5711 32.2297 165.9625 145.7301 170.3337 59.8200 61.4871 1.0606 1.3295 33.3019 5.9722 28.8197 9.0557 18.8677 21.5452 15.2881 7.8519 10.8190 4.5319 7.3078 5.2242
temp: 298.150 k
press: 1.00000 atm
elementType: 8 8 8 8 8 8 8 6 6 6 6 6 6 6 6 6 6 6 6 6 6 6 6 6 6 6 1 1 1 1 1 1 1 1 1 1 1 1 1 1 1 1
symmnumber: 1
zpe: 810585.0 jmol-1
zpe.correction: 0.308736 hartree
zpe.thermalcorrener: 0.333878 hartree
zpe.thermalcorrenthalpy: 0.334822 hartree
zpe.thermalcorrgfe: 0.252729 hartree
zpe.sumelectzpe: -1258.316391 hartree
zpe.sumelectthermal: -1258.291248 hartree
zpe.sumelectthermalent: -1258.290304 hartree
zpe.sumelectthermalfe: -1258.372398 hartree
dipole: -3.8790 0.9582 -0.2351
dipole: 4.0025
quadrupole: -121.0584 -122.2697 -162.4165
quadrupole: 3.9594 -13.5667 0.2843
quadrupole: 14.1898 12.9785 -27.1683 3.9594 -13.5667 0.2843
hfenergy: -1258.6251263 hartree
pointgroup: C01 [X(C19H16O7)]
dipole: 1.5114087 -0.4372159 -0.0646844 debye
polarizability: 365.7171606|13.7986001|271.2583798|15.1614071|-5.1078636|128.4451138 unknown
InChI: InChI=1S/C19H16O7/c1-9(20)25-13-7-5-6-11-15-12(17(22)16(11)13)8-14(23-3)18(19(15)24-4)26-10(2)21/h5-8H,1-4H3
charge 0 multiplicity 1
42 atoms
O  1.58713 -2.47024 0.664652
O  -4.580118 0.154632 -0.412376
O  3.795098 -0.509357 0.952113
O  3.347156 2.085113 0.502551
O  -2.15582 2.10029 -0.303912
O  -4.395699 1.217294 1.677137
O  4.6407 -0.191574 -1.215861
C  0.114628 -0.62112 0.30974
C  -1.179274 -1.340814 0.214322
C  -0.118225 0.767698 0.141458
C  -2.20963 -0.369747 0.000054
C  -1.590616 0.992288 -0.077943
C  1.432974 -1.092605 0.509979
C  0.902045 1.726904 0.167828
C  -3.546036 -0.77482 -0.136905
C  -1.493068 -2.708661 0.28884
C  2.477373 -0.125935 0.576146
C  2.220158 1.267055 0.399826
C  -3.875847 -2.150453 -0.078901
C  -2.852126 -3.099116 0.131993
C  2.857165 -3.128233 0.292208
C  3.152395 3.52491 0.290485
C  -4.831624 1.223765 0.516927
C  4.850792 -0.353894 -0.003623
C  6.177648 -0.439515 0.706108
C  -5.681267 2.269818 -0.15323
H  0.661135 2.782893 0.023785
H  -0.708558 -3.448058 0.462509
H  -4.920526 -2.454449 -0.191702
H  -3.115542 -4.161334 0.182792
H  2.595297 -4.192733 0.192591
H  3.614181 -2.9935 1.08141
H  3.232718 -2.740701 -0.672133
H  2.761747 3.724932 -0.724608
H  4.15249 3.967818 0.400498
H  2.467513 3.948155 1.049221
H  6.346911 0.50343 1.256557
H  6.987552 -0.584748 -0.023106
H  6.173811 -1.254748 1.448296
H  -5.012016 2.906978 -0.759685
H  -6.181077 2.89236 0.603337
H  -6.418248 1.808821 -0.829476
