program: Gaussian 09
title: 000126917
version: EM64L-G09RevD.01
frameworkgroup: C1[X(C8H8FN3O3S)]
method: RPBEPBE
basis: SDD
operation: Freq
keyword: #p
keyword: freq=noraman
keyword: PBEPBE/SDD
title: #p freq=noraman PBEPBE/SDD
converged: YES YES NO NO
title: Mulliken charges:
elementType: S F O O O N N N C C C C C C C C H H H H H H H H
charge: 0.994907 -0.151385 -0.505765 -0.534163 -0.112474 -0.251150 -0.033510 -0.006710 -0.205729 0.191261 -0.180396 -0.038870 -0.602597 -0.597336 -0.344837 0.283009 0.309618 0.255617 0.213440 0.275512 0.285555 0.226746 0.248737 0.280521
chargesum: 0.00000
title: Mulliken charges with hydrogens summed into heavy atoms:
elementType: S F O O O N N N C C C C C C C C
charge: 0.994907 -0.151385 -0.505765 -0.534163 -0.112474 -0.251150 -0.033510 -0.006710 -0.205729 0.191261 0.129222 -0.038870 0.141971 0.163703 -0.064316 0.283009
polarizability: 1.90902122e+02 -6.85992708e+00 1.58280999e+02 -1.60469447e+00 -2.35190693e+00 9.63451205e+01
1716.lowfreq: -4.0952 0.0013 0.0019 0.0022 5.0353 9.7524 27.7370 41.0890 76.8952
frequency: 27.5247 40.8801 76.8803 101.4029 119.3358 176.1745 193.1764 199.2139 204.0412 211.0117 220.7494 229.9884 240.9261 271.9981 290.9981 343.2850 385.0959 397.8567 418.4700 475.2133 483.7712 528.7194 555.8054 558.3793 597.1721 609.2994 664.4949 714.5895 766.8537 810.0406 836.3988 854.5847 859.0763 868.4090 943.7343 960.4555 965.6470 1021.7341 1045.0698 1081.5440 1100.5296 1104.4937 1180.3036 1209.4376 1212.9520 1277.4146 1292.9447 1319.5078 1411.9559 1423.6729 1453.3272 1459.7788 1468.3372 1469.7668 1473.1963 1474.1574 1533.9272 1618.6527 2928.1574 2952.2428 3046.5064 3051.2700 3100.3004 3104.6662 3149.0685 3184.8107
redmass: 5.0222 3.7411 4.8136 6.2263 5.1342 4.2596 2.6392 1.4426 6.2055 3.4116 1.7279 4.8486 9.5771 13.0842 4.5892 5.6031 4.0834 4.2346 14.0926 5.7636 11.6633 7.6752 10.5670 4.8849 7.0507 6.8528 10.0667 11.2824 9.1594 15.9044 13.7539 1.3550 4.1834 8.8346 13.3411 7.6099 1.5106 1.4151 3.3640 1.2270 2.2469 1.4345 5.3099 1.9800 1.7170 2.3449 8.7580 4.1812 1.1268 1.1313 1.0471 1.0507 5.1913 1.1833 1.2553 2.8136 7.4333 8.8661 1.0453 1.0389 1.0878 1.0961 1.0992 1.0985 1.0909 1.0941
irintensity: 3.4565 2.3411 2.0629 2.3562 1.5555 1.0115 1.9279 0.6116 0.4898 0.4230 5.0096 0.7722 1.8153 0.4485 7.6088 2.2837 3.6883 7.4854 104.8840 39.9364 9.4735 9.2127 11.3753 8.0075 10.6494 18.9141 0.2113 9.6390 2.3060 76.7746 8.6361 45.6467 37.4185 28.5845 2.1215 62.6749 6.2058 0.8263 54.4329 0.1512 11.5895 25.1867 13.1946 28.1498 14.6373 19.4382 11.0592 71.2024 24.2537 4.9742 12.8264 17.0157 7.1361 5.4933 49.4853 7.2778 92.9976 25.2603 50.9737 42.9888 12.5807 27.9637 1.9181 0.9192 6.3624 4.8266
temp: 298.150 k
press: 1.00000 atm
elementType: 16 9 8 8 8 7 7 7 6 6 6 6 6 6 6 6 1 1 1 1 1 1 1 1
symmnumber: 1
zpe: 414813.4 jmol-1
zpe.correction: 0.157994 hartree
zpe.thermalcorrener: 0.173768 hartree
zpe.thermalcorrenthalpy: 0.174712 hartree
zpe.thermalcorrgfe: 0.114284 hartree
zpe.sumelectzpe: -1196.010011 hartree
zpe.sumelectthermal: -1195.994237 hartree
zpe.sumelectthermalent: -1195.993293 hartree
zpe.sumelectthermalfe: -1196.053721 hartree
dipole: 0.8548 -1.3393 4.6419
dipole: 4.9063
quadrupole: -113.5188 -101.4829 -101.4815
quadrupole: -15.4906 -12.4314 0.3648
quadrupole: -8.0244 4.0115 4.0129 -15.4906 -12.4314 0.3648
hfenergy: -1196.1680051 hartree
pointgroup: C01 [X(C8H8F1N3O3S1)]
dipole: -0.3383891 -1.1896544 -1.4819609 debye
dipolederiv: 1.8889178 0.0088257 0.046374 0.0292715 0.9992071 -0.0658762 0.0193729 -0.0259609 1.5055091 -1.1889031 -0.2301841 -0.0157157 -0.1891971 -0.2234432 0.0174607 -0.0793077 0.0043717 -0.1196378 -0.6228702 -0.0143416 -0.0107071 -0.0721796 -0.5026931 -0.1197992 -0.033843 -0.0588873 -0.5865862 -0.6496872 0.0593483 -0.0397142 0.0924196 -0.595377 0.1157238 -0.0189457 0.0308243 -0.5327201 0.2484272 0.0749216 0.0214994 0.1990099 -0.3491482 0.089369 -0.0090545 0.0977566 -0.1087742 -0.4525244 0.0595461 -0.2738439 0.0928347 -0.4190497 -0.0362047 -0.1932193 -0.0302872 -0.4310601 -0.1299841 -0.1625401 0.0307298 0.1710884 0.0779133 -0.0443505 -0.0316564 -0.0644904 -0.0576624 -0.2757821 0.0852455 -0.0169083 -0.2518976 0.1652971 -0.100603 0.0275723 -0.063345 -0.0515981 -0.1959378 -0.0343396 0.0546964 -0.0534884 -0.1802066 -0.006946 0.1635623 0.0373318 -0.3419419 -0.1575013 -0.2223767 0.0321939 -0.3670487 0.0103657 0.0272951 0.040386 -0.0137065 0.1302895 0.0343253 -0.088356 0.0795176 0.1350768 -0.0222737 0.0104429 -0.0760374 -0.0400739 -0.0209232 -0.272394 0.1526929 -0.081991 -0.0776154 -0.0510118 0.0415096 -0.0141453 0.0720037 0.0758803 0.1583933 0.0075402 0.2585794 -0.1585551 0.0647613 0.3038815 0.0656483 0.0673002 0.1514098 0.13655 -0.0943558 0.2251331 0.0349981 0.1887467 -0.2480418 0.1846298 -0.0429135 -0.0279446 -0.2784595 0.1166523 -0.0563101 0.2075037 -0.0187943 0.0030445 -0.108836 -0.025058 -0.1207983 1.4342164 0.2358881 0.0518515 0.2397059 0.4017633 -0.0673742 0.0965938 -0.0573537 0.1435203 0.1400928 0.0469563 -0.0200532 0.0303092 0.1235925 -0.0010775 0.009377 0.0106966 0.1271628 0.0042922 -0.0243482 0.0724725 -0.0191953 0.1203465 -0.0332121 0.1262736 -0.0303585 -0.0542659 -0.062926 -0.0192548 -0.1961183 0.0772293 0.0346917 -0.03124 -0.0668693 -0.0539658 -0.0386934 0.1352976 -0.0324069 -0.0503868 0.0073212 -0.0161661 0.0158127 -0.0537585 0.10494 0.1113064 0.1613171 0.0648107 -0.0360713 0.0243246 0.0852205 -0.0373972 -0.0338464 -0.1073661 0.0459315 -0.067281 0.0709762 -0.1521872 -0.0531092 0.0033913 0.0415327 -0.1325416 0.0557215 0.0105018 -0.037097 -0.0246943 0.0767419 -0.0391455 0.0577492 0.0897677 0.1135674 0.0943644 0.0171763 0.0495177 -0.0362057 0.0002176 -0.0596607 0.0451173 0.036282 0.0050775 0.038456 0.1739183 unknown
polarizability: 190.1067405|6.6053487|151.5871988|-6.0659078|-20.341357|103.834302 unknown
InChI: InChI=1S/C8H8FN3O3S/c1-12(2)16(13,14)6-4-3-5(9)7-8(6)11-15-10-7/h3-4H,1-2H3
charge 0 multiplicity 1
24 atoms
S  2.099583 -0.322087 0.65963
F  -3.958351 -1.334088 0.044408
O  2.285665 0.97871 1.606018
O  2.601632 -1.804942 1.093703
O  -1.693507 2.280126 -0.79328
N  2.980143 0.054526 -0.941528
N  -0.394574 1.752514 -0.447728
N  -2.748245 1.312374 -0.625867
C  0.212785 -0.574154 0.370222
C  -0.657419 0.470458 -0.066798
C  -0.311344 -1.821939 0.671575
C  -2.09209 0.207626 -0.180786
C  2.778334 -1.00832 -1.948239
C  2.816732 1.454986 -1.389104
C  -1.724068 -2.090238 0.55778
C  -2.592764 -1.093444 0.148306
H  0.371941 -2.606279 1.016635
H  3.592134 -0.911422 -2.689054
H  1.805381 -0.942617 -2.483703
H  2.879581 -1.993241 -1.462999
H  2.806061 2.117313 -0.508147
H  1.900218 1.631203 -1.989122
H  3.706181 1.703782 -1.996332
H  -2.11741 -3.079651 0.806309
