program: Gaussian 09
title: 000126896
version: EM64L-G09RevD.01
frameworkgroup: C1[X(C7H10BrN7O)]
method: RPBEPBE
basis: SDD
operation: Freq
keyword: #p
keyword: freq=noraman
keyword: PBEPBE/SDD
title: #p freq=noraman PBEPBE/SDD
converged: YES YES NO NO
title: Mulliken charges:
elementType: Br O N N N N N N N C C C C C C C H H H H H H H H H H
charge: -0.020116 -0.415005 -0.198274 0.119878 -0.081031 -0.619239 -0.610597 -0.658756 -0.423420 -0.111687 0.286624 0.138877 -0.599673 0.241241 0.312882 -0.449300 0.294219 0.263790 0.222454 0.319181 0.392675 0.333516 0.333800 0.309233 0.390700 0.228031
chargesum: 0.00000
title: Mulliken charges with hydrogens summed into heavy atoms:
elementType: Br O N N N N N N N C C C C C C C
charge: -0.020116 -0.415005 -0.198274 0.119878 -0.081031 0.092617 0.056718 0.041177 -0.195389 -0.111687 0.286624 0.138877 0.180789 0.241241 0.312882 -0.449300
polarizability: 2.54894266e+02 -2.08151334e+00 1.87003967e+02 -4.63700572e+00 -1.98116961e+00 6.44265474e+01
1716.lowfreq: -7.0737 -4.8849 -0.0007 -0.0006 -0.0005 4.8089 26.3159 38.9658 63.6775
frequency: 26.2675 38.9366 63.6746 88.8443 93.1454 133.7603 202.0400 209.1771 223.1965 238.5243 269.5901 276.6013 322.5744 338.8968 355.3296 420.9767 423.9630 448.7097 472.3633 479.6674 515.2475 517.6335 536.8700 566.6853 577.5792 588.7991 631.8119 658.4956 682.7664 699.6863 706.5730 711.5646 725.4551 765.9928 784.9410 814.4332 820.6003 961.5221 1001.5789 1021.1206 1051.7413 1090.1121 1123.6416 1160.4480 1163.9882 1187.5570 1270.0374 1326.5566 1366.4121 1393.8487 1404.7125 1439.1195 1442.8532 1453.4445 1471.8316 1493.7929 1516.9824 1548.2360 1575.2788 1590.6968 1621.3360 1627.0708 3020.7479 3127.9015 3132.4095 3333.9811 3356.7797 3401.2925 3530.4295 3630.6346 3647.9986 3683.6946
redmass: 4.4117 5.7285 5.7277 7.0436 7.4946 6.7074 1.1311 5.4389 8.7262 7.4613 4.6035 5.4530 5.0827 3.1929 5.0378 3.2349 1.1455 6.0930 3.7056 3.9953 2.8175 1.2527 1.2022 2.7369 1.5709 8.7120 5.6936 7.7510 4.7722 5.9124 2.7335 7.2017 2.1938 2.4379 1.2522 1.3886 4.4633 2.5175 2.5196 1.9974 2.3498 1.7053 1.3493 3.0128 2.6481 2.5366 7.0648 5.0235 2.6270 2.2436 3.3227 2.2458 2.8467 1.1070 3.5868 1.1190 1.8326 2.6084 3.7881 1.3560 1.8931 5.6142 1.0320 1.1028 1.1030 1.0610 1.0567 1.0769 1.0448 1.0943 1.0909 1.1052
irintensity: 0.1776 1.7387 3.1382 2.5901 0.2737 3.1191 1.4847 4.7142 10.3060 1.8118 6.5923 4.3368 14.8932 18.1118 6.7062 16.6060 81.7556 18.3155 58.4952 1.7435 22.1976 117.0334 15.6911 55.3446 217.0779 8.1226 71.0200 20.3465 6.0995 64.6844 107.0172 23.4389 114.3944 5.1685 1.6585 214.7538 2.0344 21.3853 320.9867 248.9371 3.2818 0.7516 1.6700 8.1070 2.4633 15.1840 16.2764 286.9646 151.7372 44.3305 264.6268 251.3298 37.4692 23.5979 264.1065 90.5293 217.4865 117.3625 387.7369 309.2127 480.1105 174.7075 26.5896 15.9144 1.3389 295.2697 122.1210 15.4332 141.1405 92.2248 62.6876 54.2835
temp: 298.150 k
press: 1.00000 atm
elementType: 35 8 7 7 7 7 7 7 7 6 6 6 6 6 6 6 1 1 1 1 1 1 1 1 1 1
symmnumber: 1
zpe: 500046.0 jmol-1
zpe.correction: 0.190457 hartree
zpe.thermalcorrener: 0.206139 hartree
zpe.thermalcorrenthalpy: 0.207083 hartree
zpe.thermalcorrgfe: 0.146006 hartree
zpe.sumelectzpe: -743.536943 hartree
zpe.sumelectthermal: -743.521262 hartree
zpe.sumelectthermalent: -743.520318 hartree
zpe.sumelectthermalfe: -743.581395 hartree
dipole: -1.4102 4.0108 0.0486
dipole: 4.2517
quadrupole: -75.2443 -100.4805 -106.1052
quadrupole: -1.8474 -5.4986 0.5377
quadrupole: 18.6991 -6.5372 -12.1619 -1.8474 -5.4986 0.5377
hfenergy: -743.7274004 hartree
pointgroup: C01 [X(C7H10Br1N7O1)]
dipole: 0.9242083 1.2619875 0.5927574 debye
dipolederiv: -0.335339 0.2734726 0.1197948 0.4477339 -0.7396507 -0.2768039 0.2034772 -0.2853146 -0.1917774 -1.1209495 0.1323472 0.1491395 0.0893596 -0.8216795 -0.3610393 0.0368466 -0.3569816 -0.6832278 -1.7356883 -0.4559357 -0.2112615 -0.5510403 -0.5472252 -0.2524608 -0.1856508 -0.2631363 -0.4175789 0.1522648 0.241886 0.0772674 -0.6550808 -0.1083884 0.0159355 -0.3568909 -0.0257759 -0.0951002 -0.755353 0.1967127 0.1473561 0.330443 -0.6422609 -0.1808118 0.1939097 -0.2026606 -0.4010606 -0.3979879 0.3145801 0.091959 0.2176124 -1.2601273 -0.3045116 0.0885199 -0.2613513 -0.7482515 -1.7936806 0.0408074 0.0939835 -0.0423512 -0.2753986 0.1641924 0.1040389 0.1668931 -0.6135965 -0.7601838 0.2295996 0.1615897 0.0916676 -0.733798 -0.1541941 0.1173864 -0.2088244 -0.9198304 -0.8204387 -0.3350394 -0.3096184 -0.5439597 -0.798694 -0.1962777 -0.3509187 -0.1595413 -0.6125036 -0.9114184 -0.3775958 -0.1021626 0.5908247 -0.4337784 -0.213561 0.3170378 -0.161242 -0.1440165 2.2997061 0.2282662 0.1322774 0.3870895 0.8298563 0.5030989 0.3686187 0.5097954 0.5963548 0.5396009 -0.2166537 -0.1484912 -0.2335277 1.2969191 0.5184545 -0.1024739 0.5699094 0.4997897 -0.053114 -0.0860516 -0.0497857 -0.0150988 0.248119 0.0744397 -0.0521914 0.0357477 0.2378458 1.9590209 0.3785894 0.0087523 0.2024707 0.7259662 0.5389004 -0.2044194 0.5014274 0.7459647 1.9908787 0.1110821 -0.1074508 0.4899798 0.3109297 0.0223577 0.0181895 0.0144698 0.2990874 -0.3926188 -0.6750216 -0.2469893 -1.1644557 0.9533326 0.445149 -0.4458099 0.470615 0.1145063 0.122562 -0.0387816 -0.1448268 0.019777 0.1063907 -0.030957 -0.0829063 -0.0266854 0.097473 0.0943056 0.1019769 0.0250629 0.097131 -0.0344321 0.0157602 -0.0230692 0.0557181 0.0289747 0.0191606 -0.0311083 0.1345015 -0.0644707 -0.0060786 0.0675233 0.0924084 0.021263 0.026914 0.1345932 -0.0410881 0.0070171 -0.017291 0.2981061 -0.0329123 0.0099181 -0.0473123 0.3382527 0.4549323 0.0604031 0.0492532 0.0669568 0.3692013 0.0050102 0.018963 -0.0405515 0.3416221 0.2808512 0.0166158 0.0168791 0.081171 0.1841226 -0.0849747 0.0339605 -0.0821854 0.3418992 0.3225544 0.008963 0.0084644 -0.0505373 0.2396477 -0.0542024 -0.0172403 -0.0568603 0.3502052 0.0890392 -0.0768206 0.0223616 -0.1070576 0.2638845 -0.076463 -0.0182483 -0.0799014 0.2991976 0.6924314 -0.0176834 -0.0327622 0.1479659 0.2911028 -0.1225735 0.0062547 -0.0743242 0.3051431 -0.0751291 0.0164776 0.1076889 0.1846881 0.283933 -0.0290785 0.2302898 -0.0131903 0.2037132 unknown
polarizability: 251.4673252|-8.6933797|161.6345232|-14.3145936|52.6253504|93.2229323 unknown
InChI: InChI=1S/C7H10BrN7O/c1-15(7(11)12)6(16)2-4(9)14-5(10)3(8)13-2/h11H,9-10,12H2,1H3
charge 0 multiplicity 1
26 atoms
Br 2.950941 -2.48156 -1.321021
O  -1.703866 1.457878 0.886986
N  -2.09989 -0.365689 -0.548974
N  0.848532 -0.704706 -0.508932
N  2.46525 1.42176 0.281324
N  0.620747 2.632289 1.022011
N  4.380677 0.251804 -0.392076
N  -4.010981 0.357879 0.74274
N  -4.206712 -1.3556 -0.95423
C  0.233044 0.418184 -0.024925
C  -1.244006 0.512784 0.117573
C  1.101323 1.502058 0.432026
C  -1.627179 -1.246016 -1.657097
C  -3.528288 -0.469478 -0.256235
C  3.021381 0.298365 -0.241614
C  2.151259 -0.793657 -0.611376
H  -2.526472 -1.554103 -2.209101
H  -1.11487 -2.136316 -1.265339
H  -0.930225 -0.689264 -2.300733
H  1.283248 3.35058 1.308891
H  -0.390022 2.648956 1.222633
H  4.93152 1.060094 -0.109655
H  4.829538 -0.580166 -0.770417
H  -4.986828 0.273185 1.013172
H  -3.382496 1.076116 1.132288
H  -5.213825 -1.375979 -0.715418
