program: Gaussian 09
title: 000126907
version: EM64L-G09RevD.01
frameworkgroup: C1[X(C22H27N3O3S)]
method: RPBEPBE
basis: SDD
operation: Freq
keyword: #p
keyword: freq=noraman
keyword: PBEPBE/SDD
title: #p freq=noraman PBEPBE/SDD
converged: YES YES NO NO
title: Mulliken charges:
elementType: S O O O N N N C C C C C C C C C C C C C C C C C C C C C C H H H H H H H H H H H H H H H H H H H H H H H H H H H
charge: 0.213492 -0.309501 -0.351161 -0.303747 -0.086352 -0.409206 -0.376758 -0.424529 -0.362285 0.266002 0.288230 -0.535372 -0.388110 -0.315162 0.586354 0.091850 -0.408698 0.399675 -0.444006 -0.307462 -0.497775 -0.684748 -0.696808 -0.340825 -0.315097 -0.247854 -0.222704 0.338502 -0.608077 0.227529 0.202226 0.217033 0.230202 0.383265 0.216383 0.220781 0.206521 0.187741 0.254991 0.235327 0.260232 0.229894 0.225672 0.219986 0.217308 0.212967 0.215549 0.228100 0.288465 0.250690 0.234779 0.235157 0.327124 0.227228 0.226655 0.270328
chargesum: 0.00000
title: Mulliken charges with hydrogens summed into heavy atoms:
elementType: S O O O N N N C C C C C C C C C C C C C C C C C C C C C C
charge: 0.213492 -0.309501 -0.351161 -0.303747 -0.086352 -0.025940 -0.049634 0.005226 0.084950 0.266002 0.288230 -0.535372 0.049054 0.079099 0.586354 0.091850 -0.153707 0.399675 -0.208679 -0.307462 -0.007650 -0.021782 -0.040192 -0.052360 -0.064406 -0.013074 0.012453 0.338502 0.116134
polarizability: 4.23571840e+02 -2.58984426e+01 3.56594306e+02 -2.35787972e+00 2.17120134e+01 1.78725827e+02
1716.lowfreq: -5.4578 -2.9084 -0.0017 -0.0007 0.0013 3.4678 13.0403 19.1315 21.8875
frequency: 12.8879 18.9358 21.8046 28.5739 34.5113 38.5230 44.1993 53.2833 62.0022 85.6537 90.6765 98.8456 111.4515 127.8409 140.6272 146.8407 165.2530 172.9406 179.7046 198.7516 207.0032 213.9849 228.7813 249.8692 271.2283 274.8202 296.6850 308.2333 320.4966 336.1522 354.7586 378.1296 402.5253 416.9085 423.2628 430.9682 454.1946 470.4248 483.1229 490.2188 496.9818 526.9003 536.4482 550.7822 577.2272 601.6597 606.9268 647.7087 661.5932 686.9515 696.2007 717.6209 731.5599 743.0911 754.9296 762.5199 769.9616 790.9367 800.2437 804.8541 820.0810 847.6391 849.4000 864.9950 880.6621 882.6142 897.9103 911.9091 954.2416 972.9224 973.3636 977.9505 1005.3108 1006.0164 1030.9097 1036.6512 1059.8901 1062.4559 1067.5028 1078.2836 1085.1971 1088.3313 1093.7116 1115.2714 1119.5646 1126.0361 1144.8164 1149.3203 1169.1799 1171.9147 1174.3208 1199.9501 1204.7850 1214.6450 1242.0044 1246.7576 1254.0361 1276.1250 1278.4350 1293.8424 1313.0406 1326.2698 1335.4289 1339.9486 1346.2556 1358.9646 1370.0582 1375.6531 1378.6042 1383.2050 1385.8242 1393.0976 1410.1065 1424.9876 1428.4579 1455.3468 1459.5053 1462.3002 1467.6958 1471.9892 1476.6056 1480.2337 1483.5091 1484.0626 1485.4515 1489.6507 1497.4667 1498.6689 1517.5625 1536.2378 1570.5495 1587.1498 1602.5411 1618.0101 1674.3928 2863.4799 2881.8323 2947.2519 2976.7331 2978.2542 2985.9577 2991.6911 2998.8476 3002.0431 3017.5518 3034.3132 3041.6848 3052.9045 3066.2803 3073.7005 3079.2119 3081.9219 3090.1258 3110.5017 3125.4225 3132.2898 3143.1867 3144.9523 3160.0032 3173.2837 3175.5249 3578.1312
redmass: 4.7366 4.4003 3.7684 4.7464 3.6179 6.0228 5.7243 2.6729 4.2911 3.1698 3.0471 1.2061 3.7735 5.0728 2.8723 4.4279 1.7771 3.2315 4.7132 4.5279 5.9738 3.7239 1.1357 3.7249 2.4317 3.1061 1.7590 4.3542 4.8412 4.9444 4.9764 4.4350 2.4445 5.9064 3.6442 9.2806 5.0075 4.4152 3.0876 4.9595 4.2019 5.2967 3.3904 6.1617 1.1135 4.0099 5.3844 6.1223 5.2619 4.6515 11.9887 7.0465 4.2442 3.2603 2.5922 2.1320 1.1534 1.2940 1.7859 1.3913 1.7876 2.7123 1.4346 5.2784 5.8776 1.4332 1.9671 5.2374 1.4940 2.5494 1.3692 2.4825 2.6420 1.3428 3.0030 2.5795 3.3633 2.1981 1.7519 2.7329 2.3042 3.7810 4.6016 1.6882 2.0240 1.2801 1.6660 2.1089 1.5248 1.1668 1.4437 1.9794 2.0848 1.2221 1.5299 1.7217 1.9005 1.5588 1.2221 1.2166 1.6011 2.2819 1.3989 1.2736 1.6752 2.9289 1.3872 1.3291 3.8145 1.2960 1.2827 7.2266 3.8720 2.4201 1.1644 1.0626 2.4365 1.3143 1.0514 1.0679 1.0749 1.0828 1.0858 1.0464 1.1105 1.1097 3.4182 1.1599 1.4314 3.1793 5.6003 2.8187 6.2453 7.3794 8.7591 1.0715 1.0699 1.0602 1.0354 1.0351 1.0372 1.0598 1.0970 1.0579 1.0865 1.0947 1.1000 1.1026 1.1064 1.0990 1.0998 1.0999 1.1005 1.0979 1.0899 1.0861 1.0827 1.0906 1.0949 1.0989 1.0937 1.0772
irintensity: 0.2275 0.1061 0.1033 2.1150 0.0667 3.1210 3.6013 0.2681 1.0282 1.4715 1.4790 0.5050 4.4092 0.8887 1.7316 2.0225 0.6914 0.8126 0.6912 1.1064 0.5707 1.8127 0.3768 3.7673 1.3044 0.0590 1.8753 15.1756 1.3633 23.6768 0.8376 7.0676 1.1429 10.3236 0.9910 0.1539 2.9214 9.0925 1.6052 10.7067 2.3614 2.9378 13.2412 25.4985 134.2966 11.6373 10.3302 5.4204 22.3671 11.3090 23.0653 5.4952 4.2209 17.0920 10.2061 32.6289 4.4604 44.6537 43.1269 4.3060 35.9312 2.8793 49.5799 8.6917 10.3704 0.3480 2.2004 179.8906 9.1394 31.3877 2.0647 10.2326 16.6068 1.0391 21.7119 9.7838 25.7270 4.9721 6.2630 78.5077 80.4358 63.6147 230.9373 7.7917 2.5207 0.0220 23.4719 4.4970 15.6360 2.2632 9.1288 237.1592 35.7070 89.2586 15.3717 38.9624 17.6330 46.0128 32.1586 55.3110 134.6566 77.3140 10.0291 23.0913 47.3359 9.0430 2.2384 37.7214 13.7569 1.6121 23.6143 16.8025 53.9672 97.9535 27.6604 10.0865 7.6913 162.6024 10.4453 45.1312 24.5959 26.4938 34.5375 9.5568 28.9743 58.0691 168.8370 19.8083 176.7060 129.3459 38.5264 229.6697 19.9961 382.1009 260.6876 75.9740 71.3975 82.6450 93.8088 26.4069 27.6434 50.8231 16.5861 22.5252 23.6928 30.6930 24.2539 38.8797 24.5104 48.8331 75.6792 41.1630 46.0003 4.0428 21.4998 0.7836 132.7740 10.7859 10.4448 28.0254 13.9042 32.5632
temp: 298.150 k
press: 1.00000 atm
elementType: 16 8 8 8 7 7 7 6 6 6 6 6 6 6 6 6 6 6 6 6 6 6 6 6 6 6 6 6 6 1 1 1 1 1 1 1 1 1 1 1 1 1 1 1 1 1 1 1 1 1 1 1 1 1 1 1
symmnumber: 1
zpe: 1189895.8 jmol-1
zpe.correction: 0.453207 hartree
zpe.thermalcorrener: 0.482727 hartree
zpe.thermalcorrenthalpy: 0.483671 hartree
zpe.thermalcorrgfe: 0.388273 hartree
zpe.sumelectzpe: -1640.404469 hartree
zpe.sumelectthermal: -1640.374949 hartree
zpe.sumelectthermalent: -1640.374005 hartree
zpe.sumelectthermalfe: -1640.469404 hartree
dipole: 1.7838 -0.3155 2.4653
dipole: 3.0592
quadrupole: -158.0337 -164.0538 -178.8611
quadrupole: -6.2926 -16.3611 -4.2019
quadrupole: 8.9492 2.9291 -11.8782 -6.2926 -16.3611 -4.2019
hfenergy: -1640.8576764 hartree
pointgroup: C01 [X(C22H27N3O3S1)]
dipole: 0.6973307 0.2122622 -0.9577633 debye
polarizability: 422.8349709|26.6936684|352.6738696|3.5618087|35.7966727|183.3831321 unknown
InChI: InChI=1S/C22H27N3O3S/c1-4-25(5-2)13-12-24-17-11-10-15(14-28-22(27)23-3)21-19(17)20(26)16-8-6-7-9-18(16)29-21/h6-11,23-24H,4-5,12-14H2,1-3H3
charge 0 multiplicity 1
56 atoms
S  -2.967587 -0.569657 0.34911
O  -3.704573 2.587718 0.022905
O  1.287658 -1.989175 -0.45034
O  -5.7436 1.948128 1.048574
N  5.991459 1.042081 0.073315
N  2.299025 0.271641 0.160417
N  -5.618724 2.662706 -1.190547
C  4.763783 0.216634 0.039967
C  3.51176 1.079028 0.318985
C  -0.127929 -0.161982 0.248121
C  1.030181 0.726924 0.414619
C  -1.4247 0.382808 0.53544
C  7.152229 0.386124 0.726179
C  6.27944 1.705018 -1.224217
C  -1.616874 1.719619 0.974293
C  0.093111 -1.552231 -0.183958
C  0.819523 2.072236 0.848177
C  -1.024872 -2.528789 -0.323262
C  -0.468576 2.538676 1.116585
C  -2.391381 -2.220826 -0.10521
C  -2.973406 2.286746 1.299347
C  7.779144 -0.819327 -0.028113
C  7.284583 2.865808 -1.106312
C  -0.691763 -3.86266 -0.701132
C  -3.398333 -3.208449 -0.257842
C  -1.679807 -4.846539 -0.854678
C  -3.042675 -4.516747 -0.630812
C  -5.100259 2.359534 0.047584
C  -7.044894 2.526999 -1.491596
H  4.833236 -0.564441 0.820337
H  4.631767 -0.3167 -0.933209
H  3.496172 1.94892 -0.371797
H  3.589772 1.487328 1.346502
H  2.333907 -0.720223 -0.16355
H  6.820805 0.054475 1.728777
H  7.930023 1.152707 0.899128
H  5.322086 2.10828 -1.605116
H  6.637997 0.977606 -1.995543
H  1.675393 2.739417 0.971278
H  -0.60574 3.575022 1.448675
H  -3.61186 1.606275 1.893585
H  -2.8714 3.241648 1.843762
H  7.035825 -1.620547 -0.195752
H  8.187596 -0.520361 -1.010577
H  8.609372 -1.247203 0.564174
H  7.368265 3.396179 -2.072663
H  8.296035 2.5153 -0.832857
H  6.948472 3.584051 -0.337683
H  0.367978 -4.079009 -0.865277
H  -4.447889 -2.948389 -0.081941
H  -1.401694 -5.864919 -1.14497
H  -3.822201 -5.277671 -0.745827
H  -4.961256 2.967914 -1.90822
H  -7.220655 1.780647 -2.288873
H  -7.484251 3.493049 -1.802816
H  -7.552297 2.1877 -0.574547
